{"text_format":"3","workbook":"xlsx","n_sheets":11,"sheets":["Notes","PENNANT TEAMS","Blank cards","Cards Rear","New Results","Card Stickers","Result Stickers","Player List","Weekly Records","Sheet1","Results"],"not_rendered":{"images":2,"macros":1,"defined_names":19},"read":"whole","date_system":"1900"}

{"sheet":"Notes","index":0,"n_rows":18,"n_cols":2,"rows_kept":18,"merged":[[1,1,1,4],[3,1,3,8],[6,1,6,8],[7,1,7,8],[8,1,8,4],[10,1,10,8],[11,1,11,8],[13,1,13,8],[14,1,14,8],[16,1,16,8],[17,1,17,8]]}
[]
[null,"SCORE CARDS and STICKERS"]
[]
[null,"You will need some blank cards measuring 9.0cm X 13.0cm if you wish to "]
[null,"use the card printing facility attached to this file."]
[]
[null,"The cheapest way to do this is to go to Office Works and buy a ream of "]
[null,"250gsm paper and then guillotine your cards to size. Each ream will produce "]
[null,"500 cards and costs about $18.00."]
[]
[null,"If you prefer you can call Darren Muir on 02 6280 6925 and he will sell you "]
[null,"4,000 250gsm Nordset cards trimmed to 9 cm X 13cm for about $130.00"]
[]
[null,"If you would like to use stickers for your opposition cards you can purchase"]
[null,"them from MrSticker on 4353 9222. They will sell you a box for about $25.00"]
[]
[null,"Finally if you need help with this file please don't hesitate to contact"]
[null,"me on 02 4389 1138 or email me at geoffjgraham@gmail.com"]

{"sheet":"PENNANT TEAMS","index":1,"n_rows":130,"n_cols":256,"rows_kept":130,"merged":[[2,0,2,1],[2,3,2,4],[3,3,3,4],[92,0,92,4],[127,2,127,3]]}
["Column1","Column2","Column3","Column4","Column5","Column6","Column7","Column8","Column9","Column10","Column11","Column12","Column13","Column14","Column15","Column16","Column17","Column18","Column19","Column20","Column21","Column22","Column23","Column24","Column25","Column26","Column27","Column28","Column29","Column30","Column31","Column32","Column33","Column34","Column35","Column36","Column37","Column38","Column39","Column40","Column41","Column42","Column43","Column44","Column45","Column46","Column47","Column48","Column49","Column50","Column51","Column52","Column53","Column54","Column55","Column56","Column57","Column58","Column59","Column60","Column61","Column62","Column63","Column64","Column65","Column66","Column67","Column68","Column69","Column70","Column71","Column72","Column73","Column74","Column75","Column76","Column77","Column78","Column79","Column80","Column81","Column82","Column83","Column84","Column85","Column86","Column87","Column88","Column89","Column90","Column91","Column92","Column93","Column94","Column95","Column96","Column97","Column98","Column99","Column100","Column101","Column102","Column103","Column104","Column105","Column106","Column107","Column108","Column109","Column110","Column111","Column112","Column113","Column114","Column115","Column116","Column117","Column118","Column119","Column120","Column121","Column122","Column123","Column124","Column125","Column126","Column127","Column128","Column129","Column130","Column131","Column132","Column133","Column134","Column135","Column136","Column137","Column138","Column139","Column140","Column141","Column142","Column143","Column144","Column145","Column146","Column147","Column148","Column149","Column150","Column151","Column152","Column153","Column154","Column155","Column156","Column157","Column158","Column159","Column160","Column161","Column162","Column163","Column164","Column165","Column166","Column167","Column168","Column169","Column170","Column171","Column172","Column173","Column174","Column175","Column176","Column177","Column178","Column179","Column180","Column181","Column182","Column183","Column184","Column185","Column186","Column187","Column188","Column189","Column190","Column191","Column192","Column193","Column194","Column195","Column196","Column197","Column198","Column199","Column200","Column201","Column202","Column203","Column204","Column205","Column206","Column207","Column208","Column209","Column210","Column211","Column212","Column213","Column214","Column215","Column216","Column217","Column218","Column219","Column220","Column221","Column222","Column223","Column224","Column225","Column226","Column227","Column228","Column229","Column230","Column231","Column232","Column233","Column234","Column235","Column236","Column237","Column238","Column239","Column240","Column241","Column242","Column243","Column244","Column245","Column246","Column247","Column248","Column249","Column250","Column251","Column252","Column253","Column254","Column255","Column256"]
[]
["Pennants 2020",null,"Your club name here","UMPIRE/S:-"]
["DATE : -","3rd March"]
["ROUND:-",2]
[null,"LEAD","SECOND","THIRD","SKIP"]
["GRADE","away","VERSUS","Avoca",null,null,{"$f":"IF(B7=\"home\",C$3,IF(B7=\"away\",D7))","v":"Avoca"}]
[1]
["SIDE MANAGER",{"$f":"IF(B8>1,VLOOKUP(B8,BOWLERS,3,FALSE),\"\")","v":""},{"$f":"IF(C8>1,VLOOKUP(C8,BOWLERS,3,FALSE),\"\")","v":""},{"$f":"IF(D8>1,VLOOKUP(D8,BOWLERS,3,FALSE),\"\")","v":""},{"$f":"IF(E8>1,VLOOKUP(E8,BOWLERS,3,FALSE),\"\")","v":""}]
[]
[null,{"$f":"IF(B10>1,VLOOKUP(B10,BOWLERS,3,FALSE),\"\")","v":""},{"$f":"IF(C10>1,VLOOKUP(C10,BOWLERS,3,FALSE),\"\")","v":""},{"$f":"IF(D10>1,VLOOKUP(D10,BOWLERS,3,FALSE),\"\")","v":""},{"$f":"IF(E10>1,VLOOKUP(E10,BOWLERS,3,FALSE),\"\")","v":""}]
[null,"SECTION",1,"SIDE","red"]
[]
["GRADE","away","VERSUS","The Entrance",null,null,{"$f":"IF(B14=\"home\",C$3,IF(B14=\"away\",D14))","v":"The Entrance"}]
[2]
["SIDE MANAGER",{"$f":"IF(B15>1,VLOOKUP(B15,BOWLERS,3,FALSE),\"\")","v":""},{"$f":"IF(C15>1,VLOOKUP(C15,BOWLERS,3,FALSE),\"\")","v":""},{"$f":"IF(D15>1,VLOOKUP(D15,BOWLERS,3,FALSE),\"\")","v":""},{"$f":"IF(E15>1,VLOOKUP(E15,BOWLERS,3,FALSE),\"\")","v":""}]
[]
[null,{"$f":"IF(B17>1,VLOOKUP(B17,BOWLERS,3,FALSE),\"\")","v":""},{"$f":"IF(C17>1,VLOOKUP(C17,BOWLERS,3,FALSE),\"\")","v":""},{"$f":"IF(D17>1,VLOOKUP(D17,BOWLERS,3,FALSE),\"\")","v":""},{"$f":"IF(E17>1,VLOOKUP(E17,BOWLERS,3,FALSE),\"\")","v":""}]
[null,"SECTION",2,"SIDE"]
[]
["GRADE","home","VERSUS","Bateau Bay",null,null,{"$f":"IF(B21=\"home\",C$3,IF(B21=\"away\",D21))","v":"Your club name here"}]
[3.1]
["SIDE MANAGER",{"$f":"IF(B22>1,VLOOKUP(B22,BOWLERS,3,FALSE),\"\")","v":""},{"$f":"IF(C22>1,VLOOKUP(C22,BOWLERS,3,FALSE),\"\")","v":""},{"$f":"IF(D22>1,VLOOKUP(D22,BOWLERS,3,FALSE),\"\")","v":""},{"$f":"IF(E22>1,VLOOKUP(E22,BOWLERS,3,FALSE),\"\")","v":""}]
[]
[null,{"$f":"IF(B24>1,VLOOKUP(B24,BOWLERS,3,FALSE),\"\")","v":""},{"$f":"IF(C24>1,VLOOKUP(C24,BOWLERS,3,FALSE),\"\")","v":""},{"$f":"IF(D24>1,VLOOKUP(D24,BOWLERS,3,FALSE),\"\")","v":""},{"$f":"IF(E24>1,VLOOKUP(E24,BOWLERS,3,FALSE),\"\")","v":""}]
[null,"SECTION",1,"SIDE",1]
[]
["GRADE","away","VERSUS","Wyong",null,null,{"$f":"IF(B28=\"home\",C$3,IF(B28=\"away\",D28))","v":"Wyong"}]
[3.2]
["SIDE MANAGER",{"$f":"IF(B29>1,VLOOKUP(B29,BOWLERS,3,FALSE),\"\")","v":""},{"$f":"IF(C29>1,VLOOKUP(C29,BOWLERS,3,FALSE),\"\")","v":""},{"$f":"IF(D29>1,VLOOKUP(D29,BOWLERS,3,FALSE),\"\")","v":""},{"$f":"IF(E29>1,VLOOKUP(E29,BOWLERS,3,FALSE),\"\")","v":""}]
[]
[null,{"$f":"IF(B31>1,VLOOKUP(B31,BOWLERS,3,FALSE),\"\")","v":""},{"$f":"IF(C31>1,VLOOKUP(C31,BOWLERS,3,FALSE),\"\")","v":""},{"$f":"IF(D31>1,VLOOKUP(D31,BOWLERS,3,FALSE),\"\")","v":""},{"$f":"IF(E31>1,VLOOKUP(E31,BOWLERS,3,FALSE),\"\")","v":""}]
[null,"SECTION",2,"SIDE",2]
[]
["GRADE","away","VERSUS","Davistown",null,null,{"$f":"IF(B35=\"home\",C$3,IF(B35=\"away\",D35))","v":"Davistown"}]
[4.1]
["SIDE MANAGER",{"$f":"IF(B36>1,VLOOKUP(B36,BOWLERS,3,FALSE),\"\")","v":""},{"$f":"IF(C36>1,VLOOKUP(C36,BOWLERS,3,FALSE),\"\")","v":""},{"$f":"IF(D36>1,VLOOKUP(D36,BOWLERS,3,FALSE),\"\")","v":""},{"$f":"IF(E36>1,VLOOKUP(E36,BOWLERS,3,FALSE),\"\")","v":""}]
[]
[null,{"$f":"IF(B38>1,VLOOKUP(B38,BOWLERS,3,FALSE),\"\")","v":""},{"$f":"IF(C38>1,VLOOKUP(C38,BOWLERS,3,FALSE),\"\")","v":""},{"$f":"IF(D38>1,VLOOKUP(D38,BOWLERS,3,FALSE),\"\")","v":""},{"$f":"IF(E38>1,VLOOKUP(E38,BOWLERS,3,FALSE),\"\")","v":""}]
[null,"SECTION",1,"SIDE",1]
[]
["GRADE","away","VERSUS","Terrigal",null,null,{"$f":"IF(B42=\"home\",C$3,IF(B42=\"away\",D42))","v":"Terrigal"}]
[4.2]
["SIDE MANAGER",{"$f":"IF(B43>1,VLOOKUP(B43,BOWLERS,3,FALSE),\"\")","v":""},{"$f":"IF(C43>1,VLOOKUP(C43,BOWLERS,3,FALSE),\"\")","v":""},{"$f":"IF(D43>1,VLOOKUP(D43,BOWLERS,3,FALSE),\"\")","v":""},{"$f":"IF(E43>1,VLOOKUP(E43,BOWLERS,3,FALSE),\"\")","v":""}]
[]
[null,{"$f":"IF(B45>1,VLOOKUP(B45,BOWLERS,3,FALSE),\"\")","v":""},{"$f":"IF(C45>1,VLOOKUP(C45,BOWLERS,3,FALSE),\"\")","v":""},{"$f":"IF(D45>1,VLOOKUP(D45,BOWLERS,3,FALSE),\"\")","v":""},{"$f":"IF(E45>1,VLOOKUP(E45,BOWLERS,3,FALSE),\"\")","v":""}]
[null,"SECTION",2,"SIDE"]
[]
["GRADE","AWAY","VERSUS","TEAM7",null,null,{"$f":"IF(B49=\"home\",C$3,IF(B49=\"away\",D49))","v":"TEAM7"}]
[7]
["SIDE CAPTAIN",{"$f":"IF(B50>1,VLOOKUP(B50,BOWLERS,3,FALSE),\"\")","v":""},{"$f":"IF(C50>1,VLOOKUP(C50,BOWLERS,3,FALSE),\"\")","v":""},{"$f":"IF(D50>1,VLOOKUP(D50,BOWLERS,3,FALSE),\"\")","v":""},{"$f":"IF(E50>1,VLOOKUP(E50,BOWLERS,3,FALSE),\"\")","v":""}]
["Name"]
[{"$f":"IF(A52>1,VLOOKUP(A52,BOWLERS,3,FALSE),\"\")","v":{"$error":"#N/A"}},{"$f":"IF(B52>1,VLOOKUP(B52,BOWLERS,3,FALSE),\"\")","v":""},{"$f":"IF(C52>1,VLOOKUP(C52,BOWLERS,3,FALSE),\"\")","v":""},{"$f":"IF(D52>1,VLOOKUP(D52,BOWLERS,3,FALSE),\"\")","v":""},{"$f":"IF(E52>1,VLOOKUP(E52,BOWLERS,3,FALSE),\"\")","v":""}]
[null,"SECTION",7,"SIDE",7]
[]
["GRADE","AWAY","VERSUS","TEAM8",null,null,{"$f":"IF(B56=\"home\",C$3,IF(B56=\"away\",D56))","v":"TEAM8"}]
[8]
["SIDE CAPTAIN",{"$f":"IF(B57>1,VLOOKUP(B57,BOWLERS,3,FALSE),\"\")","v":""},{"$f":"IF(C57>1,VLOOKUP(C57,BOWLERS,3,FALSE),\"\")","v":""},{"$f":"IF(D57>1,VLOOKUP(D57,BOWLERS,3,FALSE),\"\")","v":""},{"$f":"IF(E57>1,VLOOKUP(E57,BOWLERS,3,FALSE),\"\")","v":""}]
["Name"]
[{"$f":"IF(A59>1,VLOOKUP(A59,BOWLERS,3,FALSE),\"\")","v":{"$error":"#N/A"}},{"$f":"IF(B59>1,VLOOKUP(B59,BOWLERS,3,FALSE),\"\")","v":""},{"$f":"IF(C59>1,VLOOKUP(C59,BOWLERS,3,FALSE),\"\")","v":""},{"$f":"IF(D59>1,VLOOKUP(D59,BOWLERS,3,FALSE),\"\")","v":""},{"$f":"IF(E59>1,VLOOKUP(E59,BOWLERS,3,FALSE),\"\")","v":""}]
[null,"SECTION",8,"SIDE",8]
[]
["GRADE","AWAY","VERSUS","TEAM9",null,null,{"$f":"IF(B63=\"home\",C$3,IF(B63=\"away\",D63))","v":"TEAM9"}]
[9]
["SIDE CAPTAIN",{"$f":"IF(B64>1,VLOOKUP(B64,BOWLERS,3,FALSE),\"\")","v":""},{"$f":"IF(C64>1,VLOOKUP(C64,BOWLERS,3,FALSE),\"\")","v":""},{"$f":"IF(D64>1,VLOOKUP(D64,BOWLERS,3,FALSE),\"\")","v":""},{"$f":"IF(E64>1,VLOOKUP(E64,BOWLERS,3,FALSE),\"\")","v":""}]
["Name"]
[{"$f":"IF(A66>1,VLOOKUP(A66,BOWLERS,3,FALSE),\"\")","v":{"$error":"#N/A"}},{"$f":"IF(B66>1,VLOOKUP(B66,BOWLERS,3,FALSE),\"\")","v":""},{"$f":"IF(C66>1,VLOOKUP(C66,BOWLERS,3,FALSE),\"\")","v":""},{"$f":"IF(D66>1,VLOOKUP(D66,BOWLERS,3,FALSE),\"\")","v":""},{"$f":"IF(E66>1,VLOOKUP(E66,BOWLERS,3,FALSE),\"\")","v":""}]
[null,"SECTION  ",9,"SIDE",9]
[]
["OUT FOR YEAR","RESERVES","RESERVES","RESERVES","UNAVAILABLE"]
[]
[{"$f":"IF(A71>1,VLOOKUP(A71,BOWLERS,3,FALSE),\"\")","v":""},{"$f":"IF(B71>1,VLOOKUP(B71,BOWLERS,3,FALSE),\"\")","v":""},{"$f":"IF(C71>1,VLOOKUP(C71,BOWLERS,3,FALSE),\"\")","v":""},{"$f":"IF(D71>1,VLOOKUP(D71,BOWLERS,3,FALSE),\"\")","v":""},{"$f":"IF(E71>1,VLOOKUP(E71,BOWLERS,3,FALSE),\"\")","v":""}]
[]
[{"$f":"IF(A73>1,VLOOKUP(A73,BOWLERS,3,FALSE),\"\")","v":""},{"$f":"IF(B73>1,VLOOKUP(B73,BOWLERS,3,FALSE),\"\")","v":""},{"$f":"IF(C73>1,VLOOKUP(C73,BOWLERS,3,FALSE),\"\")","v":""},{"$f":"IF(D73>1,VLOOKUP(D73,BOWLERS,3,FALSE),\"\")","v":""},{"$f":"IF(E73>1,VLOOKUP(E73,BOWLERS,3,FALSE),\"\")","v":""}]
[]
[{"$f":"IF(A75>1,VLOOKUP(A75,BOWLERS,3,FALSE),\"\")","v":""},{"$f":"IF(B75>1,VLOOKUP(B75,BOWLERS,3,FALSE),\"\")","v":""},{"$f":"IF(C75>1,VLOOKUP(C75,BOWLERS,3,FALSE),\"\")","v":""},{"$f":"IF(D75>1,VLOOKUP(D75,BOWLERS,3,FALSE),\"\")","v":""},{"$f":"IF(E75>1,VLOOKUP(E75,BOWLERS,3,FALSE),\"\")","v":""}]
[]
[{"$f":"IF(A77>1,VLOOKUP(A77,BOWLERS,3,FALSE),\"\")","v":""},{"$f":"IF(B77>1,VLOOKUP(B77,BOWLERS,3,FALSE),\"\")","v":""},{"$f":"IF(C77>1,VLOOKUP(C77,BOWLERS,3,FALSE),\"\")","v":""},{"$f":"IF(D77>1,VLOOKUP(D77,BOWLERS,3,FALSE),\"\")","v":""},{"$f":"IF(E77>1,VLOOKUP(E77,BOWLERS,3,FALSE),\"\")","v":""}]
[]
[{"$f":"IF(A79>1,VLOOKUP(A79,BOWLERS,3,FALSE),\"\")","v":""},{"$f":"IF(B79>1,VLOOKUP(B79,BOWLERS,3,FALSE),\"\")","v":""},{"$f":"IF(C79>1,VLOOKUP(C79,BOWLERS,3,FALSE),\"\")","v":""},{"$f":"IF(D79>1,VLOOKUP(D79,BOWLERS,3,FALSE),\"\")","v":""},{"$f":"IF(E79>1,VLOOKUP(E79,BOWLERS,3,FALSE),\"\")","v":""}]
[]
[{"$f":"IF(A81>1,VLOOKUP(A81,BOWLERS,3,FALSE),\"\")","v":""},{"$f":"IF(B81>1,VLOOKUP(B81,BOWLERS,3,FALSE),\"\")","v":""},{"$f":"IF(C81>1,VLOOKUP(C81,BOWLERS,3,FALSE),\"\")","v":""},{"$f":"IF(D81>1,VLOOKUP(D81,BOWLERS,3,FALSE),\"\")","v":""},{"$f":"IF(E81>1,VLOOKUP(E81,BOWLERS,3,FALSE),\"\")","v":""}]
[]
[{"$f":"IF(A83>1,VLOOKUP(A83,BOWLERS,3,FALSE),\"\")","v":""},{"$f":"IF(B83>1,VLOOKUP(B83,BOWLERS,3,FALSE),\"\")","v":""},{"$f":"IF(C83>1,VLOOKUP(C83,BOWLERS,3,FALSE),\"\")","v":""},{"$f":"IF(D83>1,VLOOKUP(D83,BOWLERS,3,FALSE),\"\")","v":""},{"$f":"IF(E83>1,VLOOKUP(E83,BOWLERS,3,FALSE),\"\")","v":""}]
[]
[{"$f":"IF(A85>1,VLOOKUP(A85,BOWLERS,3,FALSE),\"\")","v":""},{"$f":"IF(B85>1,VLOOKUP(B85,BOWLERS,3,FALSE),\"\")","v":""},{"$f":"IF(C85>1,VLOOKUP(C85,BOWLERS,3,FALSE),\"\")","v":""},{"$f":"IF(D85>1,VLOOKUP(D85,BOWLERS,3,FALSE),\"\")","v":""},{"$f":"IF(E85>1,VLOOKUP(E85,BOWLERS,3,FALSE),\"\")","v":""}]
[]
[{"$f":"IF(A87>1,VLOOKUP(A87,BOWLERS,3,FALSE),\"\")","v":""},{"$f":"IF(B87>1,VLOOKUP(B87,BOWLERS,3,FALSE),\"\")","v":""},{"$f":"IF(C87>1,VLOOKUP(C87,BOWLERS,3,FALSE),\"\")","v":""},{"$f":"IF(D87>1,VLOOKUP(D87,BOWLERS,3,FALSE),\"\")","v":""},{"$f":"IF(E87>1,VLOOKUP(E87,BOWLERS,3,FALSE),\"\")","v":""}]
{"$rows_empty":39}
[null,null,"RNSWBA  records"]
["1-Mar"]
["Bowlers",null,"Membership No.","Grade"]

{"sheet":"Blank cards","index":2,"n_rows":270,"n_cols":21,"rows_kept":270,"merged":[[0,0,0,3],[0,4,0,23],[2,0,2,9],[2,10,2,13],[2,14,2,23],[3,0,3,4],[3,5,3,23],[4,0,4,3],[4,4,4,6],[4,7,4,11],[4,12,4,14],[4,15,4,18],[4,19,4,23],[5,0,5,3],[5,4,5,6],[5,7,5,11],[5,12,5,14],[5,15,5,18],[5,19,5,23],[6,10,6,13],[7,0,7,10],[7,11,7,12],[7,13,7,23],[8,0,8,10],[8,11,8,12],[8,13,8,23],[9,0,9,10],[9,11,9,12],[9,13,9,23],[10,0,10,10],[10,11,10,12],[10,13,10,23],[12,0,12,3],[12,4,12,11],[12,12,12,15],[12,16,12,23],[13,0,13,2],[13,3,13,11],[13,12,13,15],[13,16,13,23],[14,0,14,23],[15,0,15,3],[15,4,15,23],[17,0,17,9],[17,10,17,13],[17,14,17,23],[18,0,18,4],[18,5,18,23],[19,0,19,3],[19,4,19,6],[19,7,19,11],[19,12,19,14],[19,15,19,18],[19,19,19,23],[20,0,20,3],[20,4,20,6],[20,7,20,11],[20,12,20,14],[20,15,20,18],[20,19,20,23],[21,10,21,13],[22,0,22,10],[22,11,22,12],[22,13,22,23],[23,0,23,10],[23,11,23,12],[23,13,23,23],[24,0,24,10],[24,11,24,12],[24,13,24,23],[25,0,25,10],[25,11,25,12],[25,13,25,23],[27,0,27,3],[27,4,27,11],[27,12,27,15],[27,16,27,23],[28,0,28,2],[28,3,28,11],[28,12,28,15],[28,16,28,23],[29,0,29,23],[30,0,30,3],[30,4,30,23],[32,0,32,9],[32,10,32,13],[32,14,32,23],[33,0,33,4],[33,5,33,23],[34,0,34,3],[34,4,34,6],[34,7,34,11],[34,12,34,14],[34,15,34,18],[34,19,34,23],[35,0,35,3],[35,4,35,6],[35,7,35,11],[35,12,35,14],[35,15,35,18],[35,19,35,23],[36,10,36,13],[37,0,37,10],[37,11,37,12],[37,13,37,23],[38,0,38,10],[38,11,38,12],[38,13,38,23],[39,0,39,10],[39,11,39,12],[39,13,39,23],[40,0,40,10],[40,11,40,12],[40,13,40,23],[42,0,42,3],[42,4,42,11],[42,12,42,15],[42,16,42,23],[43,0,43,2],[43,3,43,11],[43,12,43,15],[43,16,43,23],[44,0,44,23],[45,0,45,3],[45,4,45,23],[47,0,47,9],[47,10,47,13],[47,14,47,23],[48,0,48,4],[48,5,48,23],[49,0,49,3],[49,4,49,6],[49,7,49,11],[49,12,49,14],[49,15,49,18],[49,19,49,23],[50,0,50,3],[50,4,50,6],[50,7,50,11],[50,12,50,14],[50,15,50,18],[50,19,50,23],[51,10,51,13],[52,0,52,10],[52,11,52,12],[52,13,52,23],[53,0,53,10],[53,11,53,12],[53,13,53,23],[54,0,54,10],[54,11,54,12],[54,13,54,23],[55,0,55,10],[55,11,55,12],[55,13,55,23],[57,0,57,3],[57,4,57,11],[57,12,57,15],[57,16,57,23],[58,0,58,2],[58,3,58,11],[58,12,58,15],[58,16,58,23],[59,0,59,23],[60,0,60,3],[60,4,60,23],[62,0,62,9],[62,10,62,13],[62,14,62,23],[63,0,63,4],[63,5,63,23],[64,0,64,3],[64,4,64,6],[64,7,64,11],[64,12,64,14],[64,15,64,18],[64,19,64,23],[65,0,65,3],[65,4,65,6],[65,7,65,11],[65,12,65,14],[65,15,65,18],[65,19,65,23],[66,10,66,13],[67,0,67,10],[67,11,67,12],[67,13,67,23],[68,0,68,10],[68,11,68,12],[68,13,68,23],[69,0,69,10],[69,11,69,12],[69,13,69,23],[70,0,70,10],[70,11,70,12],[70,13,70,23],[72,0,72,3],[72,4,72,11],[72,12,72,15],[72,16,72,23],[73,0,73,2],[73,3,73,11],[73,12,73,15],[73,16,73,23],[74,0,74,23],[75,0,75,3],[75,4,75,23],[77,0,77,9],[77,10,77,13],[77,14,77,23],[78,0,78,4],[78,5,78,23],[79,0,79,3],[79,4,79,6],[79,7,79,11],[79,12,79,14],[79,15,79,18],[79,19,79,23],[80,0,80,3],[80,4,80,6],[80,7,80,11],[80,12,80,14],[80,15,80,18],[80,19,80,23],[81,10,81,13],[82,0,82,10],[82,11,82,12],[82,13,82,23],[83,0,83,10],[83,11,83,12],[83,13,83,23],[84,0,84,10],[84,11,84,12],[84,13,84,23],[85,0,85,10],[85,11,85,12],[85,13,85,23],[87,0,87,3],[87,4,87,11],[87,12,87,15],[87,16,87,23],[88,0,88,2],[88,3,88,11],[88,12,88,15],[88,16,88,23],[89,0,89,23],[90,0,90,3],[90,4,90,23],[92,0,92,9],[92,10,92,13],[92,14,92,23],[93,0,93,4],[93,5,93,23],[94,0,94,3],[94,4,94,6],[94,7,94,11],[94,12,94,14],[94,15,94,18],[94,19,94,23],[95,0,95,3],[95,4,95,6],[95,7,95,11],[95,12,95,14],[95,15,95,18],[95,19,95,23],[96,10,96,13],[97,0,97,10],[97,11,97,12],[97,13,97,23],[98,0,98,10],[98,11,98,12],[98,13,98,23],[99,0,99,10],[99,11,99,12],[99,13,99,23],[100,0,100,10],[100,11,100,12],[100,13,100,23],[102,0,102,3],[102,4,102,11],[102,12,102,15],[102,16,102,23],[103,0,103,2],[103,3,103,11],[103,12,103,15],[103,16,103,23],[104,0,104,23],[105,0,105,3],[105,4,105,23],[107,0,107,9],[107,10,107,13],[107,14,107,23],[108,0,108,4],[108,5,108,23],[109,0,109,3],[109,4,109,6],[109,7,109,11],[109,12,109,14],[109,15,109,18],[109,19,109,23],[110,0,110,3],[110,4,110,6],[110,7,110,11],[110,12,110,14],[110,15,110,18],[110,19,110,23],[111,10,111,13],[112,0,112,10],[112,11,112,12],[112,13,112,23],[113,0,113,10],[113,11,113,12],[113,13,113,23],[114,0,114,10],[114,11,114,12],[114,13,114,23],[115,0,115,10],[115,11,115,12],[115,13,115,23],[117,0,117,3],[117,4,117,11],[117,12,117,15],[117,16,117,23],[118,0,118,2],[118,3,118,11],[118,12,118,15],[118,16,118,23],[119,0,119,23],[120,0,120,3],[120,4,120,23],[122,0,122,9],[122,10,122,13],[122,14,122,23],[123,0,123,4],[123,5,123,23],[124,0,124,3],[124,4,124,6],[124,7,124,11],[124,12,124,14],[124,15,124,18],[124,19,124,23],[125,0,125,3],[125,4,125,6],[125,7,125,11],[125,12,125,14],[125,15,125,18],[125,19,125,23],[126,10,126,13],[127,0,127,10],[127,11,127,12],[127,13,127,23],[128,0,128,10],[128,11,128,12],[128,13,128,23],[129,0,129,10],[129,11,129,12],[129,13,129,23],[130,0,130,10],[130,11,130,12],[130,13,130,23],[132,0,132,3],[132,4,132,11],[132,12,132,15],[132,16,132,23],[133,0,133,2],[133,3,133,11],[133,12,133,15],[133,16,133,23],[134,0,134,23],[135,0,135,3],[135,4,135,23],[137,0,137,9],[137,10,137,13],[137,14,137,23],[138,0,138,4],[138,5,138,23],[139,0,139,3],[139,4,139,6],[139,7,139,11],[139,12,139,14],[139,15,139,18],[139,19,139,23],[140,0,140,3],[140,4,140,6],[140,7,140,11],[140,12,140,14],[140,15,140,18],[140,19,140,23],[141,10,141,13],[142,0,142,10],[142,11,142,12],[142,13,142,23],[143,0,143,10],[143,11,143,12],[143,13,143,23],[144,0,144,10],[144,11,144,12],[144,13,144,23],[145,0,145,10],[145,11,145,12],[145,13,145,23],[147,0,147,3],[147,4,147,11],[147,12,147,15],[147,16,147,23],[148,0,148,2],[148,3,148,11],[148,12,148,15],[148,16,148,23],[149,0,149,23],[150,0,150,3],[150,4,150,23],[152,0,152,9],[152,10,152,13],[152,14,152,23],[153,0,153,4],[153,5,153,23],[154,0,154,3],[154,4,154,6],[154,7,154,11],[154,12,154,14],[154,15,154,18],[154,19,154,23],[155,0,155,3],[155,4,155,6],[155,7,155,11],[155,12,155,14],[155,15,155,18],[155,19,155,23],[156,10,156,13],[157,0,157,10],[157,11,157,12],[157,13,157,23],[158,0,158,10],[158,11,158,12],[158,13,158,23],[159,0,159,10],[159,11,159,12],[159,13,159,23],[160,0,160,10],[160,11,160,12],[160,13,160,23],[162,0,162,3],[162,4,162,11],[162,12,162,15],[162,16,162,23],[163,0,163,2],[163,3,163,11],[163,12,163,15],[163,16,163,23],[164,0,164,23],[165,0,165,3],[165,4,165,23],[167,0,167,9],[167,10,167,13],[167,14,167,23],[168,0,168,4],[168,5,168,23],[169,0,169,3],[169,4,169,6],[169,7,169,11],[169,12,169,14],[169,15,169,18],[169,19,169,23],[170,0,170,3],[170,4,170,6],[170,7,170,11],[170,12,170,14],[170,15,170,18],[170,19,170,23],[171,10,171,13],[172,0,172,10],[172,11,172,12],[172,13,172,23],[173,0,173,10],[173,11,173,12],[173,13,173,23],[174,0,174,10],[174,11,174,12],[174,13,174,23],[175,0,175,10],[175,11,175,12],[175,13,175,23],[177,0,177,3],[177,4,177,11],[177,12,177,15],[177,16,177,23],[178,0,178,2],[178,3,178,11],[178,12,178,15],[178,16,178,23],[179,0,179,23],[180,0,180,3],[180,4,180,23],[182,0,182,9],[182,10,182,13],[182,14,182,23],[183,0,183,4],[183,5,183,23],[184,0,184,3],[184,4,184,6],[184,7,184,11],[184,12,184,14],[184,15,184,18],[184,19,184,23],[185,0,185,3],[185,4,185,6],[185,7,185,11],[185,12,185,14],[185,15,185,18],[185,19,185,23],[186,10,186,13],[187,0,187,10],[187,11,187,12],[187,13,187,23],[188,0,188,10],[188,11,188,12],[188,13,188,23],[189,0,189,10],[189,11,189,12],[189,13,189,23],[190,0,190,10],[190,11,190,12],[190,13,190,23],[192,0,192,3],[192,4,192,11],[192,12,192,15],[192,16,192,23],[193,0,193,2],[193,3,193,11],[193,12,193,15],[193,16,193,23],[194,0,194,23],[195,0,195,3],[195,4,195,23],[197,0,197,9],[197,10,197,13],[197,14,197,23],[198,0,198,4],[198,5,198,23],[199,0,199,3],[199,4,199,6],[199,7,199,11],[199,12,199,14],[199,15,199,18],[199,19,199,23],[200,0,200,3],[200,4,200,6],[200,7,200,11],[200,12,200,14],[200,15,200,18],[200,19,200,23],[201,10,201,13],[202,0,202,10],[202,11,202,12],[202,13,202,23],[203,0,203,10],[203,11,203,12],[203,13,203,23],[204,0,204,10],[204,11,204,12],[204,13,204,23],[205,0,205,10],[205,11,205,12],[205,13,205,23],[207,0,207,3],[207,4,207,11],[207,12,207,15],[207,16,207,23],[208,0,208,2],[208,3,208,11],[208,12,208,15],[208,16,208,23],[209,0,209,23],[210,0,210,3],[210,4,210,23],[212,0,212,9],[212,10,212,13],[212,14,212,23],[213,0,213,4],[213,5,213,23],[214,0,214,3],[214,4,214,6],[214,7,214,11],[214,12,214,14],[214,15,214,18],[214,19,214,23],[215,0,215,3],[215,4,215,6],[215,7,215,11],[215,12,215,14],[215,15,215,18],[215,19,215,23],[216,10,216,13],[217,0,217,10],[217,11,217,12],[217,13,217,23],[218,0,218,10],[218,11,218,12],[218,13,218,23],[219,0,219,10],[219,11,219,12],[219,13,219,23],[220,0,220,10],[220,11,220,12],[220,13,220,23],[222,0,222,3],[222,4,222,11],[222,12,222,15],[222,16,222,23],[223,0,223,2],[223,3,223,11],[223,12,223,15],[223,16,223,23],[224,0,224,23],[225,0,225,3],[225,4,225,23],[227,0,227,9],[227,10,227,13],[227,14,227,23],[228,0,228,4],[228,5,228,23],[229,0,229,3],[229,4,229,6],[229,7,229,11],[229,12,229,14],[229,15,229,18],[229,19,229,23],[230,0,230,3],[230,4,230,6],[230,7,230,11],[230,12,230,14],[230,15,230,18],[230,19,230,23],[231,10,231,13],[232,0,232,10],[232,11,232,12],[232,13,232,23],[233,0,233,10],[233,11,233,12],[233,13,233,23],[234,0,234,10],[234,11,234,12],[234,13,234,23],[235,0,235,10],[235,11,235,12],[235,13,235,23],[237,0,237,3],[237,4,237,11],[237,12,237,15],[237,16,237,23],[238,0,238,2],[238,3,238,11],[238,12,238,15],[238,16,238,23],[239,0,239,23],[240,0,240,3],[240,4,240,23],[242,0,242,9],[242,10,242,13],[242,14,242,23],[243,0,243,4],[243,5,243,23],[244,0,244,3],[244,4,244,6],[244,7,244,11],[244,12,244,14],[244,15,244,18],[244,19,244,23],[245,0,245,3],[245,4,245,6],[245,7,245,11],[245,12,245,14],[245,15,245,18],[245,19,245,23],[246,10,246,13],[247,0,247,10],[247,11,247,12],[247,13,247,23],[248,0,248,10],[248,11,248,12],[248,13,248,23],[249,0,249,10],[249,11,249,12],[249,13,249,23],[250,0,250,10],[250,11,250,12],[250,13,250,23],[252,0,252,3],[252,4,252,11],[252,12,252,15],[252,16,252,23],[253,0,253,2],[253,3,253,11],[253,12,253,15],[253,16,253,23],[254,0,254,23],[255,0,255,3],[255,4,255,23],[257,0,257,9],[257,10,257,13],[257,14,257,23],[258,0,258,4],[258,5,258,23],[259,0,259,3],[259,4,259,6],[259,7,259,11],[259,12,259,14],[259,15,259,18],[259,19,259,23],[260,0,260,3],[260,4,260,6],[260,7,260,11],[260,12,260,14],[260,15,260,18],[260,19,260,23],[261,10,261,13],[262,0,262,10],[262,11,262,12],[262,13,262,23],[263,0,263,10],[263,11,263,12],[263,13,263,23],[264,0,264,10],[264,11,264,12],[264,13,264,23],[265,0,265,10],[265,11,265,12],[265,13,265,23],[267,0,267,3],[267,4,267,11],[267,12,267,15],[267,16,267,23],[268,0,268,2],[268,3,268,11],[268,12,268,15],[268,16,268,23],[269,0,269,23]]}
["DATE",{"$nulls":3},{"$f":"'PENNANT TEAMS'!$B$4","v":"3rd March"},{"$nulls":3},"2009-04-14",{"$nulls":3},"2009-04-14",{"$nulls":3},"2009-04-14",{"$nulls":3},"2009-04-14"]
[]
[{"$f":"'PENNANT TEAMS'!$C$3","v":"Your club name here"},{"$nulls":9},"CLUB PLAYS",{"$nulls":3},{"$f":"'PENNANT TEAMS'!$D$7","v":"Avoca"}]
["EVENT",{"$nulls":4},{"$f":"'PENNANT TEAMS'!$A$3","v":"Pennants 2020"}]
["GREEN",{"$nulls":3},"RINK",null,null,"GRADE",{"$nulls":4},"SEC.",null,null,"TEAM",{"$nulls":3},"ROUND"]
[{"$nulls":7},{"$f":"'PENNANT TEAMS'!$A$8","v":1},{"$nulls":4},{"$f":"'PENNANT TEAMS'!$C$12","v":1},null,null,{"$f":"'PENNANT TEAMS'!$E$12","v":"red"},{"$nulls":3},{"$f":"'PENNANT TEAMS'!$B$5","v":2}]
[{"$nulls":10},"TEAMS"]
[{"$f":"'PENNANT TEAMS'!$B$8","v":0},{"$nulls":10},"L"]
[{"$f":"'PENNANT TEAMS'!$C$8","v":0},{"$nulls":10},"S"]
[{"$f":"'PENNANT TEAMS'!$D$8","v":0},{"$nulls":10},"T"]
[{"$f":"'PENNANT TEAMS'!$E$8","v":0},{"$nulls":10},"Sk"]
[]
["SCORE",{"$nulls":11},"SCORE"]
["SIGN & TIME",{"$nulls":11},"SIGN"]
["FINISH TIME"]
["DATE",{"$nulls":3},{"$f":"'PENNANT TEAMS'!$B$4","v":"3rd March"},{"$nulls":3},"2009-04-14",{"$nulls":3},"2009-04-14",{"$nulls":3},"2009-04-14",{"$nulls":3},"2009-04-14"]
[]
[{"$f":"'PENNANT TEAMS'!$C$3","v":"Your club name here"},{"$nulls":9},"CLUB PLAYS",{"$nulls":3},{"$f":"'PENNANT TEAMS'!$D$7","v":"Avoca"}]
["EVENT",{"$nulls":4},{"$f":"'PENNANT TEAMS'!$A$3","v":"Pennants 2020"}]
["GREEN",{"$nulls":3},"RINK",null,null,"GRADE",{"$nulls":4},"SEC.",null,null,"TEAM",{"$nulls":3},"ROUND"]
[{"$nulls":7},{"$f":"'PENNANT TEAMS'!$A$8","v":1},{"$nulls":4},{"$f":"'PENNANT TEAMS'!$C$12","v":1},null,null,{"$f":"'PENNANT TEAMS'!$E$12","v":"red"},{"$nulls":3},{"$f":"'PENNANT TEAMS'!$B$5","v":2}]
[{"$nulls":10},"TEAMS"]
[{"$f":"'PENNANT TEAMS'!$B$10","v":0},{"$nulls":10},"L"]
[{"$f":"'PENNANT TEAMS'!$C$10","v":0},{"$nulls":10},"S"]
[{"$f":"'PENNANT TEAMS'!$D$10","v":0},{"$nulls":10},"T"]
[{"$f":"'PENNANT TEAMS'!$E$10","v":0},{"$nulls":10},"Sk"]
[]
["SCORE",{"$nulls":11},"SCORE"]
["SIGN",{"$nulls":11},"SIGN"]
["FINISH TIME"]
["DATE",{"$nulls":3},{"$f":"'PENNANT TEAMS'!$B$4","v":"3rd March"},{"$nulls":3},"2009-04-14",{"$nulls":3},"2009-04-14",{"$nulls":3},"2009-04-14",{"$nulls":3},"2009-04-14"]
[]
[{"$f":"'PENNANT TEAMS'!$C$3","v":"Your club name here"},{"$nulls":9},"CLUB PLAYS",{"$nulls":3},{"$f":"'PENNANT TEAMS'!$D$14","v":"The Entrance"}]
["EVENT",{"$nulls":4},{"$f":"'PENNANT TEAMS'!$A$3","v":"Pennants 2020"}]
["GREEN",{"$nulls":3},"RINK",null,null,"GRADE",{"$nulls":4},"SEC.",null,null,"TEAM",{"$nulls":3},"ROUND"]
[{"$nulls":7},{"$f":"'PENNANT TEAMS'!$A$15","v":2},{"$nulls":4},{"$f":"'PENNANT TEAMS'!$C$19","v":2},null,null,{"$f":"'PENNANT TEAMS'!$E$19","v":0},{"$nulls":3},{"$f":"'PENNANT TEAMS'!$B$5","v":2}]
[{"$nulls":10},"TEAMS"]
[{"$f":"'PENNANT TEAMS'!$B$15","v":0},{"$nulls":10},"L"]
[{"$f":"'PENNANT TEAMS'!$C$15","v":0},{"$nulls":10},"S"]
[{"$f":"'PENNANT TEAMS'!$D$15","v":0},{"$nulls":10},"T"]
[{"$f":"'PENNANT TEAMS'!$E$15","v":0},{"$nulls":10},"Sk"]
[]
["SCORE",{"$nulls":11},"SCORE"]
["SIGN",{"$nulls":11},"SIGN"]
["FINISH TIME"]
["DATE",{"$nulls":3},{"$f":"'PENNANT TEAMS'!$B$4","v":"3rd March"},{"$nulls":3},"2009-04-14",{"$nulls":3},"2009-04-14",{"$nulls":3},"2009-04-14",{"$nulls":3},"2009-04-14"]
[]
[{"$f":"'PENNANT TEAMS'!$C$3","v":"Your club name here"},{"$nulls":9},"CLUB PLAYS",{"$nulls":3},{"$f":"'PENNANT TEAMS'!$D$14","v":"The Entrance"}]
["EVENT",{"$nulls":4},{"$f":"'PENNANT TEAMS'!$A$3","v":"Pennants 2020"}]
["GREEN",{"$nulls":3},"RINK",null,null,"GRADE",{"$nulls":4},"SEC.",null,null,"TEAM",{"$nulls":3},"ROUND"]
[{"$nulls":7},{"$f":"'PENNANT TEAMS'!$A$15","v":2},{"$nulls":4},{"$f":"'PENNANT TEAMS'!$C$19","v":2},null,null,{"$f":"'PENNANT TEAMS'!$E$19","v":0},{"$nulls":3},{"$f":"'PENNANT TEAMS'!$B$5","v":2}]
[{"$nulls":10},"TEAMS"]
[{"$f":"'PENNANT TEAMS'!$B$17","v":0},{"$nulls":10},"L"]
[{"$f":"'PENNANT TEAMS'!$C$17","v":0},{"$nulls":10},"S"]
[{"$f":"'PENNANT TEAMS'!$D$17","v":0},{"$nulls":10},"T"]
[{"$f":"'PENNANT TEAMS'!$E$17","v":0},{"$nulls":10},"Sk"]
[]
["SCORE",{"$nulls":11},"SCORE"]
["SIGN",{"$nulls":11},"SIGN"]
["FINISH TIME"]
["DATE",{"$nulls":3},{"$f":"'PENNANT TEAMS'!$B$4","v":"3rd March"},{"$nulls":3},"2009-04-14",{"$nulls":3},"2009-04-14",{"$nulls":3},"2009-04-14",{"$nulls":3},"2009-04-14"]
[]
[{"$f":"'PENNANT TEAMS'!$C$3","v":"Your club name here"},{"$nulls":9},"CLUB PLAYS",{"$nulls":3},{"$f":"'PENNANT TEAMS'!$D$21","v":"Bateau Bay"}]
["EVENT",{"$nulls":4},{"$f":"'PENNANT TEAMS'!$A$3","v":"Pennants 2020"}]
["GREEN",{"$nulls":3},"RINK",null,null,"GRADE",{"$nulls":4},"SEC.",null,null,"TEAM",{"$nulls":3},"ROUND"]
[{"$nulls":7},{"$f":"'PENNANT TEAMS'!$A$22","v":3.1},{"$nulls":4},{"$f":"'PENNANT TEAMS'!$C$26","v":1},null,null,{"$f":"'PENNANT TEAMS'!$E$26","v":1},{"$nulls":3},{"$f":"'PENNANT TEAMS'!$B$5","v":2}]
[{"$nulls":10},"TEAMS"]
[{"$f":"'PENNANT TEAMS'!$B$22","v":0},{"$nulls":10},"L"]
[{"$f":"'PENNANT TEAMS'!$C$22","v":0},{"$nulls":10},"S"]
[{"$f":"'PENNANT TEAMS'!$D$22","v":0},{"$nulls":10},"T"]
[{"$f":"'PENNANT TEAMS'!$E$22","v":0},{"$nulls":10},"Sk"]
[]
["SCORE",{"$nulls":11},"SCORE"]
["SIGN",{"$nulls":11},"SIGN"]
["FINISH TIME"]
["DATE",{"$nulls":3},{"$f":"'PENNANT TEAMS'!$B$4","v":"3rd March"},{"$nulls":3},"2009-04-14",{"$nulls":3},"2009-04-14",{"$nulls":3},"2009-04-14",{"$nulls":3},"2009-04-14"]
[]
[{"$f":"'PENNANT TEAMS'!$C$3","v":"Your club name here"},{"$nulls":9},"CLUB PLAYS",{"$nulls":3},{"$f":"'PENNANT TEAMS'!$D$21","v":"Bateau Bay"}]
["EVENT",{"$nulls":4},{"$f":"'PENNANT TEAMS'!$A$3","v":"Pennants 2020"}]
["GREEN",{"$nulls":3},"RINK",null,null,"GRADE",{"$nulls":4},"SEC.",null,null,"TEAM",{"$nulls":3},"ROUND"]
[{"$nulls":7},{"$f":"'PENNANT TEAMS'!$A$22","v":3.1},{"$nulls":4},{"$f":"'PENNANT TEAMS'!$C$26","v":1},null,null,{"$f":"'PENNANT TEAMS'!$E$26","v":1},{"$nulls":3},{"$f":"'PENNANT TEAMS'!$B$5","v":2}]
[{"$nulls":10},"TEAMS"]
[{"$f":"'PENNANT TEAMS'!$B$24","v":0},{"$nulls":10},"L"]
[{"$f":"'PENNANT TEAMS'!$C$24","v":0},{"$nulls":10},"S"]
[{"$f":"'PENNANT TEAMS'!$D$24","v":0},{"$nulls":10},"T"]
[{"$f":"'PENNANT TEAMS'!$E$24","v":0},{"$nulls":10},"Sk"]
[]
["SCORE",{"$nulls":11},"SCORE"]
["SIGN",{"$nulls":11},"SIGN"]
["FINISH TIME"]
["DATE",{"$nulls":3},{"$f":"'PENNANT TEAMS'!$B$4","v":"3rd March"},{"$nulls":3},"2009-04-14",{"$nulls":3},"2009-04-14",{"$nulls":3},"2009-04-14",{"$nulls":3},"2009-04-14"]
[]
[{"$f":"'PENNANT TEAMS'!$C$3","v":"Your club name here"},{"$nulls":9},"CLUB PLAYS",{"$nulls":3},{"$f":"'PENNANT TEAMS'!$D$28","v":"Wyong"}]
["EVENT",{"$nulls":4},{"$f":"'PENNANT TEAMS'!$A$3","v":"Pennants 2020"}]
["GREEN",{"$nulls":3},"RINK",null,null,"GRADE",{"$nulls":4},"SEC.",null,null,"TEAM",{"$nulls":3},"ROUND"]
[{"$nulls":7},{"$f":"'PENNANT TEAMS'!$A$29","v":3.2},{"$nulls":4},{"$f":"'PENNANT TEAMS'!$C$33","v":2},null,null,{"$f":"'PENNANT TEAMS'!$E$33","v":2},{"$nulls":3},{"$f":"'PENNANT TEAMS'!$B$5","v":2}]
[{"$nulls":10},"TEAMS"]
[{"$f":"'PENNANT TEAMS'!$B$29","v":0},{"$nulls":10},"L"]
[{"$f":"'PENNANT TEAMS'!$C$29","v":0},{"$nulls":10},"S"]
[{"$f":"'PENNANT TEAMS'!$D$29","v":0},{"$nulls":10},"T"]
[{"$f":"'PENNANT TEAMS'!$E$29","v":0},{"$nulls":10},"Sk"]
[]
["SCORE",{"$nulls":11},"SCORE"]
["SIGN",{"$nulls":11},"SIGN"]
["FINISH TIME"]
["DATE",{"$nulls":3},{"$f":"'PENNANT TEAMS'!$B$4","v":"3rd March"},{"$nulls":3},"2009-04-14",{"$nulls":3},"2009-04-14",{"$nulls":3},"2009-04-14",{"$nulls":3},"2009-04-14"]
[]
[{"$f":"'PENNANT TEAMS'!$C$3","v":"Your club name here"},{"$nulls":9},"CLUB PLAYS",{"$nulls":3},{"$f":"'PENNANT TEAMS'!$D$28","v":"Wyong"}]
["EVENT",{"$nulls":4},{"$f":"'PENNANT TEAMS'!$A$3","v":"Pennants 2020"}]
["GREEN",{"$nulls":3},"RINK",null,null,"GRADE",{"$nulls":4},"SEC.",null,null,"TEAM",{"$nulls":3},"ROUND"]
[{"$nulls":7},{"$f":"'PENNANT TEAMS'!$A$29","v":3.2},{"$nulls":4},{"$f":"'PENNANT TEAMS'!$C$33","v":2},null,null,{"$f":"'PENNANT TEAMS'!$E$33","v":2},{"$nulls":3},{"$f":"'PENNANT TEAMS'!$B$5","v":2}]
[{"$nulls":10},"TEAMS"]
[{"$f":"'PENNANT TEAMS'!$B$31","v":0},{"$nulls":10},"L"]
[{"$f":"'PENNANT TEAMS'!$C$31","v":0},{"$nulls":10},"S"]
[{"$f":"'PENNANT TEAMS'!$D$31","v":0},{"$nulls":10},"T"]
[{"$f":"'PENNANT TEAMS'!$E$31","v":0},{"$nulls":10},"Sk"]
[]
["SCORE",{"$nulls":11},"SCORE"]
["SIGN",{"$nulls":11},"SIGN"]
["FINISH TIME"]
["DATE",{"$nulls":3},{"$f":"'PENNANT TEAMS'!$B$4","v":"3rd March"},{"$nulls":3},"2009-04-14",{"$nulls":3},"2009-04-14",{"$nulls":3},"2009-04-14",{"$nulls":3},"2009-04-14"]
[]
[{"$f":"'PENNANT TEAMS'!$C$3","v":"Your club name here"},{"$nulls":9},"CLUB PLAYS",{"$nulls":3},{"$f":"'PENNANT TEAMS'!$D$35","v":"Davistown"}]
["EVENT",{"$nulls":4},{"$f":"'PENNANT TEAMS'!$A$3","v":"Pennants 2020"}]
["GREEN",{"$nulls":3},"RINK",null,null,"GRADE",{"$nulls":4},"SEC.",null,null,"TEAM",{"$nulls":3},"ROUND"]
[{"$nulls":7},{"$f":"'PENNANT TEAMS'!$A$36","v":4.1},{"$nulls":4},{"$f":"'PENNANT TEAMS'!$C$40","v":1},null,null,{"$f":"'PENNANT TEAMS'!$E$40","v":1},{"$nulls":3},{"$f":"'PENNANT TEAMS'!$B$5","v":2}]
[{"$nulls":10},"TEAMS"]
[{"$f":"'PENNANT TEAMS'!$B$36","v":0},{"$nulls":10},"L"]
[{"$f":"'PENNANT TEAMS'!$C$36","v":0},{"$nulls":10},"S"]
[{"$f":"'PENNANT TEAMS'!$D$36","v":0},{"$nulls":10},"T"]
[{"$f":"'PENNANT TEAMS'!$E$36","v":0},{"$nulls":10},"Sk"]
[]
["SCORE",{"$nulls":11},"SCORE"]
["SIGN",{"$nulls":11},"SIGN"]
["FINISH TIME"]
["DATE",{"$nulls":3},{"$f":"'PENNANT TEAMS'!$B$4","v":"3rd March"},{"$nulls":3},"2009-04-14",{"$nulls":3},"2009-04-14",{"$nulls":3},"2009-04-14",{"$nulls":3},"2009-04-14"]
[]
[{"$f":"'PENNANT TEAMS'!$C$3","v":"Your club name here"},{"$nulls":9},"CLUB PLAYS",{"$nulls":3},{"$f":"'PENNANT TEAMS'!$D$35","v":"Davistown"}]
["EVENT",{"$nulls":4},{"$f":"'PENNANT TEAMS'!$A$3","v":"Pennants 2020"}]
["GREEN",{"$nulls":3},"RINK",null,null,"GRADE",{"$nulls":4},"SEC.",null,null,"TEAM",{"$nulls":3},"ROUND"]
[{"$nulls":7},{"$f":"'PENNANT TEAMS'!$A$36","v":4.1},{"$nulls":4},{"$f":"'PENNANT TEAMS'!$C$40","v":1},null,null,{"$f":"'PENNANT TEAMS'!$E$40","v":1},{"$nulls":3},{"$f":"'PENNANT TEAMS'!$B$5","v":2}]
[{"$nulls":10},"TEAMS"]
[{"$f":"'PENNANT TEAMS'!$B$38","v":0},{"$nulls":10},"L"]
[{"$f":"'PENNANT TEAMS'!$C$38","v":0},{"$nulls":10},"S"]
[{"$f":"'PENNANT TEAMS'!$D$38","v":0},{"$nulls":10},"T"]
[{"$f":"'PENNANT TEAMS'!$E$38","v":0},{"$nulls":10},"Sk"]
[]
["SCORE",{"$nulls":11},"SCORE"]
["SIGN",{"$nulls":11},"SIGN"]
["FINISH TIME"]
["DATE",{"$nulls":3},{"$f":"'PENNANT TEAMS'!$B$4","v":"3rd March"},{"$nulls":3},"2009-04-14",{"$nulls":3},"2009-04-14",{"$nulls":3},"2009-04-14",{"$nulls":3},"2009-04-14"]
[]
[{"$f":"'PENNANT TEAMS'!$C$3","v":"Your club name here"},{"$nulls":9},"CLUB PLAYS",{"$nulls":3},{"$f":"'PENNANT TEAMS'!$D$42","v":"Terrigal"}]
["EVENT",{"$nulls":4},{"$f":"'PENNANT TEAMS'!$A$3","v":"Pennants 2020"}]
["GREEN",{"$nulls":3},"RINK",null,null,"GRADE",{"$nulls":4},"SEC.",null,null,"TEAM",{"$nulls":3},"ROUND"]
[{"$nulls":7},{"$f":"'PENNANT TEAMS'!$A$43","v":4.2},{"$nulls":4},{"$f":"'PENNANT TEAMS'!$C$47","v":2},null,null,{"$f":"'PENNANT TEAMS'!$E$47","v":0},{"$nulls":3},{"$f":"'PENNANT TEAMS'!$B$5","v":2}]
[{"$nulls":10},"TEAMS"]
[{"$f":"'PENNANT TEAMS'!$B$43","v":0},{"$nulls":10},"L"]
[{"$f":"'PENNANT TEAMS'!$C$43","v":0},{"$nulls":10},"S"]
[{"$f":"'PENNANT TEAMS'!$D$43","v":0},{"$nulls":10},"T"]
[{"$f":"'PENNANT TEAMS'!$E$43","v":0},{"$nulls":10},"Sk"]
[]
["SCORE",{"$nulls":11},"SCORE"]
["SIGN",{"$nulls":11},"SIGN"]
["FINISH TIME"]
["DATE",{"$nulls":3},{"$f":"'PENNANT TEAMS'!$B$4","v":"3rd March"},{"$nulls":3},"2009-04-14",{"$nulls":3},"2009-04-14",{"$nulls":3},"2009-04-14",{"$nulls":3},"2009-04-14"]
[]
[{"$f":"'PENNANT TEAMS'!$C$3","v":"Your club name here"},{"$nulls":9},"CLUB PLAYS",{"$nulls":3},{"$f":"'PENNANT TEAMS'!$D$42","v":"Terrigal"}]
["EVENT",{"$nulls":4},{"$f":"'PENNANT TEAMS'!$A$3","v":"Pennants 2020"}]
["GREEN",{"$nulls":3},"RINK",null,null,"GRADE",{"$nulls":4},"SEC.",null,null,"TEAM",{"$nulls":3},"ROUND"]
[{"$nulls":7},{"$f":"'PENNANT TEAMS'!$A$43","v":4.2},{"$nulls":4},{"$f":"'PENNANT TEAMS'!$C$47","v":2},null,null,{"$f":"'PENNANT TEAMS'!$E$47","v":0},{"$nulls":3},{"$f":"'PENNANT TEAMS'!$B$5","v":2}]
[{"$nulls":10},"TEAMS"]
[{"$f":"'PENNANT TEAMS'!$B$45","v":0},{"$nulls":10},"L"]
[{"$f":"'PENNANT TEAMS'!$C$45","v":0},{"$nulls":10},"S"]
[{"$f":"'PENNANT TEAMS'!$D$45","v":0},{"$nulls":10},"T"]
[{"$f":"'PENNANT TEAMS'!$E$45","v":0},{"$nulls":10},"Sk"]
[]
["SCORE",{"$nulls":11},"SCORE"]
["SIGN",{"$nulls":11},"SIGN"]
["FINISH TIME"]
["DATE",{"$nulls":3},{"$f":"'PENNANT TEAMS'!$B$4","v":"3rd March"},{"$nulls":3},"2009-04-14",{"$nulls":3},"2009-04-14",{"$nulls":3},"2009-04-14",{"$nulls":3},"2009-04-14"]
[]
[{"$f":"'PENNANT TEAMS'!$C$3","v":"Your club name here"},{"$nulls":9},"CLUB PLAYS",{"$nulls":3},{"$f":"IF('PENNANT TEAMS'!$B$49=\"HOME\",'PENNANT TEAMS'!$D$49,IF('PENNANT TEAMS'!$B$49=\"away\",'PENNANT TEAMS'!$C$3,\"\"))","v":"Your club name here"}]
["EVENT",{"$nulls":4},{"$f":"'PENNANT TEAMS'!$A$3","v":"Pennants 2020"}]
["GREEN",{"$nulls":3},"RINK",null,null,"GRADE",{"$nulls":4},"SEC.",null,null,"TEAM",{"$nulls":3},"ROUND"]
[{"$nulls":7},{"$f":"'PENNANT TEAMS'!$A$50","v":7},{"$nulls":4},{"$f":"'PENNANT TEAMS'!$C$54","v":7},null,null,{"$f":"'PENNANT TEAMS'!$E$54","v":7},{"$nulls":3},{"$f":"'PENNANT TEAMS'!$B$5","v":2}]
[{"$nulls":10},"TEAMS"]
[{"$f":"'PENNANT TEAMS'!$B$50","v":0},{"$nulls":10},"L"]
[{"$f":"'PENNANT TEAMS'!$C$50","v":0},{"$nulls":10},"S"]
[{"$f":"'PENNANT TEAMS'!$D$50","v":0},{"$nulls":10},"T"]
[{"$f":"'PENNANT TEAMS'!$E$50","v":0},{"$nulls":10},"Sk"]
[]
["SCORE",{"$nulls":11},"SCORE"]
["SIGN",{"$nulls":11},"SIGN"]
["FINISH TIME"]
["DATE",{"$nulls":3},{"$f":"'PENNANT TEAMS'!$B$4","v":"3rd March"},{"$nulls":3},"2009-04-14",{"$nulls":3},"2009-04-14",{"$nulls":3},"2009-04-14",{"$nulls":3},"2009-04-14"]
[]
[{"$f":"'PENNANT TEAMS'!$C$3","v":"Your club name here"},{"$nulls":9},"CLUB PLAYS",{"$nulls":3},{"$f":"IF('PENNANT TEAMS'!$B$49=\"HOME\",'PENNANT TEAMS'!$D$49,IF('PENNANT TEAMS'!$B$49=\"away\",'PENNANT TEAMS'!$C$3,\"\"))","v":"Your club name here"}]
["EVENT",{"$nulls":4},{"$f":"'PENNANT TEAMS'!$A$3","v":"Pennants 2020"}]
["GREEN",{"$nulls":3},"RINK",null,null,"GRADE",{"$nulls":4},"SEC.",null,null,"TEAM",{"$nulls":3},"ROUND"]
[{"$nulls":7},{"$f":"'PENNANT TEAMS'!$A$50","v":7},{"$nulls":4},{"$f":"'PENNANT TEAMS'!$C$54","v":7},null,null,{"$f":"'PENNANT TEAMS'!$E$54","v":7},{"$nulls":3},{"$f":"'PENNANT TEAMS'!$B$5","v":2}]
[{"$nulls":10},"TEAMS"]
[{"$f":"'PENNANT TEAMS'!$B$52","v":0},{"$nulls":10},"L"]
[{"$f":"'PENNANT TEAMS'!$C$52","v":0},{"$nulls":10},"S"]
[{"$f":"'PENNANT TEAMS'!$D$52","v":0},{"$nulls":10},"T"]
[{"$f":"'PENNANT TEAMS'!$E$52","v":0},{"$nulls":10},"Sk"]
[]
["SCORE",{"$nulls":11},"SCORE"]
["SIGN",{"$nulls":11},"SIGN"]
["FINISH TIME"]
["DATE",{"$nulls":3},{"$f":"'PENNANT TEAMS'!$B$4","v":"3rd March"},{"$nulls":3},"2009-04-14",{"$nulls":3},"2009-04-14",{"$nulls":3},"2009-04-14",{"$nulls":3},"2009-04-14"]
[]
[{"$f":"'PENNANT TEAMS'!$C$3","v":"Your club name here"},{"$nulls":9},"CLUB PLAYS",{"$nulls":3},{"$f":"IF('PENNANT TEAMS'!$B$56=\"HOME\",'PENNANT TEAMS'!$D$56,IF('PENNANT TEAMS'!$B$56=\"away\",'PENNANT TEAMS'!$C$3,\"\"))","v":"Your club name here"}]
["EVENT",{"$nulls":4},{"$f":"'PENNANT TEAMS'!$A$3","v":"Pennants 2020"}]
["GREEN",{"$nulls":3},"RINK",null,null,"GRADE",{"$nulls":4},"SEC.",null,null,"TEAM",{"$nulls":3},"ROUND"]
[{"$nulls":7},{"$f":"'PENNANT TEAMS'!$A$57","v":8},{"$nulls":4},{"$f":"'PENNANT TEAMS'!$C$61","v":8},null,null,{"$f":"'PENNANT TEAMS'!$E$61","v":8},{"$nulls":3},{"$f":"'PENNANT TEAMS'!$B$5","v":2}]
[{"$nulls":10},"TEAMS"]
[{"$f":"'PENNANT TEAMS'!$B$57","v":0},{"$nulls":10},"L"]
[{"$f":"'PENNANT TEAMS'!$C$57","v":0},{"$nulls":10},"S"]
[{"$f":"'PENNANT TEAMS'!$D$57","v":0},{"$nulls":10},"T"]
[{"$f":"'PENNANT TEAMS'!$E$57","v":0},{"$nulls":10},"Sk"]
[]
["SCORE",{"$nulls":11},"SCORE"]
["SIGN",{"$nulls":11},"SIGN"]
["FINISH TIME"]
["DATE",{"$nulls":3},{"$f":"'PENNANT TEAMS'!$B$4","v":"3rd March"},{"$nulls":3},"2009-04-14",{"$nulls":3},"2009-04-14",{"$nulls":3},"2009-04-14",{"$nulls":3},"2009-04-14"]
[]
[{"$f":"'PENNANT TEAMS'!$C$3","v":"Your club name here"},{"$nulls":9},"CLUB PLAYS",{"$nulls":3},{"$f":"IF('PENNANT TEAMS'!$B$56=\"HOME\",'PENNANT TEAMS'!$D$56,IF('PENNANT TEAMS'!$B$56=\"away\",'PENNANT TEAMS'!$C$3,\"\"))","v":"Your club name here"}]
["EVENT",{"$nulls":4},{"$f":"'PENNANT TEAMS'!$A$3","v":"Pennants 2020"}]
["GREEN",{"$nulls":3},"RINK",null,null,"GRADE",{"$nulls":4},"SEC.",null,null,"TEAM",{"$nulls":3},"ROUND"]
[{"$nulls":7},{"$f":"'PENNANT TEAMS'!$A$57","v":8},{"$nulls":4},{"$f":"'PENNANT TEAMS'!$C$61","v":8},null,null,{"$f":"'PENNANT TEAMS'!$E$61","v":8},{"$nulls":3},{"$f":"'PENNANT TEAMS'!$B$5","v":2}]
[{"$nulls":10},"TEAMS"]
[{"$f":"'PENNANT TEAMS'!$B$59","v":0},{"$nulls":10},"L"]
[{"$f":"'PENNANT TEAMS'!$C$59","v":0},{"$nulls":10},"S"]
[{"$f":"'PENNANT TEAMS'!$D$59","v":0},{"$nulls":10},"T"]
[{"$f":"'PENNANT TEAMS'!$E$59","v":0},{"$nulls":10},"Sk"]
[]
["SCORE",{"$nulls":11},"SCORE"]
["SIGN",{"$nulls":11},"SIGN"]
["FINISH TIME"]
["DATE",{"$nulls":3},{"$f":"'PENNANT TEAMS'!$B$4","v":"3rd March"},{"$nulls":3},"2009-04-14",{"$nulls":3},"2009-04-14",{"$nulls":3},"2009-04-14",{"$nulls":3},"2009-04-14"]
[]
[{"$f":"'PENNANT TEAMS'!$C$3","v":"Your club name here"},{"$nulls":9},"CLUB PLAYS",{"$nulls":3},{"$f":"IF('PENNANT TEAMS'!$B$63=\"HOME\",'PENNANT TEAMS'!$D$63,IF('PENNANT TEAMS'!$B$63=\"away\",'PENNANT TEAMS'!$C$3,\"\"))","v":"Your club name here"}]
["EVENT",{"$nulls":4},{"$f":"'PENNANT TEAMS'!$A$3","v":"Pennants 2020"}]
["GREEN",{"$nulls":3},"RINK",null,null,"GRADE",{"$nulls":4},"SEC.",null,null,"TEAM",{"$nulls":3},"ROUND"]
[{"$nulls":7},{"$f":"'PENNANT TEAMS'!$A$64","v":9},{"$nulls":4},{"$f":"'PENNANT TEAMS'!$C$68","v":9},null,null,{"$f":"'PENNANT TEAMS'!$E$68","v":9},{"$nulls":3},{"$f":"'PENNANT TEAMS'!$B$5","v":2}]
[{"$nulls":10},"TEAMS"]
[{"$f":"'PENNANT TEAMS'!$B$64","v":0},{"$nulls":10},"L"]
[{"$f":"'PENNANT TEAMS'!$C$64","v":0},{"$nulls":10},"S"]
[{"$f":"'PENNANT TEAMS'!$D$64","v":0},{"$nulls":10},"T"]
[{"$f":"'PENNANT TEAMS'!$E$64","v":0},{"$nulls":10},"Sk"]
[]
["SCORE",{"$nulls":11},"SCORE"]
["SIGN",{"$nulls":11},"SIGN"]
["FINISH TIME"]
["DATE",{"$nulls":3},{"$f":"'PENNANT TEAMS'!$B$4","v":"3rd March"},{"$nulls":3},"2009-04-14",{"$nulls":3},"2009-04-14",{"$nulls":3},"2009-04-14",{"$nulls":3},"2009-04-14"]
[]
[{"$f":"'PENNANT TEAMS'!$C$3","v":"Your club name here"},{"$nulls":9},"CLUB PLAYS",{"$nulls":3},{"$f":"IF('PENNANT TEAMS'!$B$63=\"HOME\",'PENNANT TEAMS'!$D$63,IF('PENNANT TEAMS'!$B$63=\"away\",'PENNANT TEAMS'!$C$3,\"\"))","v":"Your club name here"}]
["EVENT",{"$nulls":4},{"$f":"'PENNANT TEAMS'!$A$3","v":"Pennants 2020"}]
["GREEN",{"$nulls":3},"RINK",null,null,"GRADE",{"$nulls":4},"SEC.",null,null,"TEAM",{"$nulls":3},"ROUND"]
[{"$nulls":7},{"$f":"'PENNANT TEAMS'!$A$64","v":9},{"$nulls":4},{"$f":"'PENNANT TEAMS'!$C$68","v":9},null,null,{"$f":"'PENNANT TEAMS'!$E$68","v":9},{"$nulls":3},{"$f":"'PENNANT TEAMS'!$B$5","v":2}]
[{"$nulls":10},"TEAMS"]
[{"$f":"'PENNANT TEAMS'!$B$66","v":0},{"$nulls":10},"L"]
[{"$f":"'PENNANT TEAMS'!$C$66","v":0},{"$nulls":10},"S"]
[{"$f":"'PENNANT TEAMS'!$D$66","v":0},{"$nulls":10},"T"]
[{"$f":"'PENNANT TEAMS'!$E$66","v":0},{"$nulls":10},"Sk"]
[]
["SCORE",{"$nulls":11},"SCORE"]
["SIGN",{"$nulls":11},"SIGN"]
["FINISH TIME"]

{"sheet":"Cards Rear","index":3,"n_rows":16,"n_cols":10,"rows_kept":16,"merged":[[1,1,1,2],[1,3,1,4],[1,6,1,7],[1,8,1,9]]}
[1]
[]
["End","Shots","Total","Shots","Total","End","Shots","Total","Shots","Total"]
[1,{"$nulls":4},14]
[2,{"$nulls":4},15]
[3,{"$nulls":4},16]
[4,{"$nulls":4},17]
[5,{"$nulls":4},18]
[6,{"$nulls":4},19]
[7,{"$nulls":4},20]
[8,{"$nulls":4},21]
[9,{"$nulls":4},22]
[10,{"$nulls":4},23]
[11,{"$nulls":4},24]
[12,{"$nulls":4},25]
[13,{"$nulls":4},"T"]

{"sheet":"New Results","index":4,"n_rows":240,"n_cols":51,"rows_kept":240,"merged":[[1,16,1,37],[3,1,3,3],[3,4,3,7],[3,12,3,15],[3,16,3,19],[3,36,3,37],[3,42,3,52],[5,1,5,6],[5,28,5,36],[7,1,7,5],[7,6,7,24],[7,28,7,32],[7,33,7,51],[9,4,9,11],[9,13,9,17],[9,19,9,21],[9,23,9,25],[9,31,9,38],[9,40,9,44],[9,46,9,48],[9,50,9,52],[10,1,10,3],[10,4,10,11],[10,13,10,17],[10,19,10,21],[10,28,10,30],[10,31,10,38],[10,40,10,44],[10,46,10,48],[12,1,12,3],[12,4,12,11],[12,13,12,17],[12,19,12,21],[12,23,14,25],[12,28,12,30],[12,31,12,38],[12,40,12,44],[12,46,12,48],[12,50,14,52],[14,1,14,3],[14,4,14,11],[14,13,14,17],[14,19,14,21],[14,28,14,30],[14,31,14,38],[14,40,14,44],[14,46,14,48],[16,1,16,3],[16,4,16,11],[16,13,16,17],[16,19,16,21],[16,28,16,30],[16,31,16,38],[16,40,16,44],[16,46,16,48],[18,1,18,3],[18,4,18,11],[18,13,18,17],[18,19,18,21],[18,28,18,30],[18,31,18,38],[18,40,18,44],[18,46,18,48],[20,1,20,3],[20,4,20,11],[20,13,20,17],[20,19,20,21],[20,23,22,25],[20,28,20,30],[20,31,20,38],[20,40,20,44],[20,46,20,48],[20,50,22,52],[22,1,22,3],[22,4,22,11],[22,13,22,17],[22,19,22,21],[22,28,22,30],[22,31,22,38],[22,40,22,44],[22,46,22,48],[24,1,24,3],[24,4,24,11],[24,13,24,17],[24,19,24,21],[24,28,24,30],[24,31,24,38],[24,40,24,44],[24,46,24,48],[26,1,26,7],[26,28,26,34],[27,1,27,7],[27,28,27,34],[28,1,28,7],[28,28,28,34],[33,45,33,46],[36,40,37,45],[36,46,37,46],[38,40,38,45],[38,46,38,48],[41,16,41,37],[43,1,43,3],[43,4,43,7],[43,12,43,15],[43,16,43,19],[43,36,43,37],[43,42,43,52],[45,1,45,6],[45,28,45,36],[47,1,47,5],[47,6,47,24],[47,28,47,32],[47,33,47,51],[49,4,49,11],[49,13,49,17],[49,19,49,21],[49,23,49,25],[49,31,49,38],[49,40,49,44],[49,46,49,48],[49,50,49,52],[50,1,50,3],[50,4,50,11],[50,13,50,17],[50,19,50,21],[50,28,50,30],[50,31,50,38],[50,40,50,44],[50,46,50,48],[52,1,52,3],[52,4,52,11],[52,13,52,17],[52,19,52,21],[52,23,54,25],[52,28,52,30],[52,31,52,38],[52,40,52,44],[52,46,52,48],[52,50,54,52],[54,1,54,3],[54,4,54,11],[54,13,54,17],[54,19,54,21],[54,28,54,30],[54,31,54,38],[54,40,54,44],[54,46,54,48],[56,1,56,3],[56,4,56,11],[56,13,56,17],[56,19,56,21],[56,28,56,30],[56,31,56,38],[56,40,56,44],[56,46,56,48],[58,1,58,3],[58,4,58,11],[58,13,58,17],[58,19,58,21],[58,28,58,30],[58,31,58,38],[58,40,58,44],[58,46,58,48],[60,1,60,3],[60,4,60,11],[60,13,60,17],[60,19,60,21],[60,23,62,25],[60,28,60,30],[60,31,60,38],[60,40,60,44],[60,46,60,48],[60,50,62,52],[62,1,62,3],[62,4,62,11],[62,13,62,17],[62,19,62,21],[62,28,62,30],[62,31,62,38],[62,40,62,44],[62,46,62,48],[64,1,64,3],[64,4,64,11],[64,13,64,17],[64,19,64,21],[64,28,64,30],[64,31,64,38],[64,40,64,44],[64,46,64,48],[66,1,66,7],[66,28,66,34],[67,1,67,7],[67,28,67,34],[68,1,68,7],[68,28,68,34],[73,45,73,46],[76,40,77,45],[76,46,77,46],[78,40,78,45],[78,46,78,48],[81,16,81,37],[83,1,83,3],[83,4,83,7],[83,12,83,15],[83,16,83,19],[83,36,83,37],[83,42,83,52],[85,1,85,6],[85,28,85,36],[87,1,87,5],[87,6,87,24],[87,28,87,32],[87,33,87,51],[89,4,89,11],[89,13,89,17],[89,19,89,21],[89,23,89,25],[89,31,89,38],[89,40,89,44],[89,46,89,48],[89,50,89,52],[90,1,90,3],[90,4,90,11],[90,13,90,17],[90,19,90,21],[90,28,90,30],[90,31,90,38],[90,40,90,44],[90,46,90,48],[92,1,92,3],[92,4,92,11],[92,13,92,17],[92,19,92,21],[92,23,94,25],[92,28,92,30],[92,31,92,38],[92,40,92,44],[92,46,92,48],[92,50,94,52],[94,1,94,3],[94,4,94,11],[94,13,94,17],[94,19,94,21],[94,28,94,30],[94,31,94,38],[94,40,94,44],[94,46,94,48],[96,1,96,3],[96,4,96,11],[96,13,96,17],[96,19,96,21],[96,28,96,30],[96,31,96,38],[96,40,96,44],[96,46,96,48],[98,1,98,3],[98,4,98,11],[98,13,98,17],[98,19,98,21],[98,28,98,30],[98,31,98,38],[98,40,98,44],[98,46,98,48],[100,1,100,3],[100,4,100,11],[100,13,100,17],[100,19,100,21],[100,23,102,25],[100,28,100,30],[100,31,100,38],[100,40,100,44],[100,46,100,48],[100,50,102,52],[102,1,102,3],[102,4,102,11],[102,13,102,17],[102,19,102,21],[102,28,102,30],[102,31,102,38],[102,40,102,44],[102,46,102,48],[104,1,104,3],[104,4,104,11],[104,13,104,17],[104,19,104,21],[104,28,104,30],[104,31,104,38],[104,40,104,44],[104,46,104,48],[106,1,106,7],[106,28,106,34],[107,1,107,7],[107,28,107,34],[108,1,108,7],[108,28,108,34],[113,45,113,46],[116,40,117,45],[116,46,117,46],[118,40,118,45],[118,46,118,48],[121,16,121,37],[123,1,123,3],[123,4,123,7],[123,12,123,15],[123,16,123,19],[123,36,123,37],[123,42,123,52],[125,1,125,6],[125,28,125,36],[127,1,127,5],[127,6,127,24],[127,28,127,32],[127,33,127,51],[129,4,129,11],[129,13,129,17],[129,19,129,21],[129,23,129,25],[129,31,129,38],[129,40,129,44],[129,46,129,48],[129,50,129,52],[130,1,130,3],[130,4,130,11],[130,13,130,17],[130,19,130,21],[130,28,130,30],[130,31,130,38],[130,40,130,44],[130,46,130,48],[132,1,132,3],[132,4,132,11],[132,13,132,17],[132,19,132,21],[132,23,134,25],[132,28,132,30],[132,31,132,38],[132,40,132,44],[132,46,132,48],[132,50,134,52],[134,1,134,3],[134,4,134,11],[134,13,134,17],[134,19,134,21],[134,28,134,30],[134,31,134,38],[134,40,134,44],[134,46,134,48],[136,1,136,3],[136,4,136,11],[136,13,136,17],[136,19,136,21],[136,28,136,30],[136,31,136,38],[136,40,136,44],[136,46,136,48],[138,1,138,3],[138,4,138,11],[138,13,138,17],[138,19,138,21],[138,28,138,30],[138,31,138,38],[138,40,138,44],[138,46,138,48],[140,1,140,3],[140,4,140,11],[140,13,140,17],[140,19,140,21],[140,23,142,25],[140,28,140,30],[140,31,140,38],[140,40,140,44],[140,46,140,48],[140,50,142,52],[142,1,142,3],[142,4,142,11],[142,13,142,17],[142,19,142,21],[142,28,142,30],[142,31,142,38],[142,40,142,44],[142,46,142,48],[144,1,144,3],[144,4,144,11],[144,13,144,17],[144,19,144,21],[144,28,144,30],[144,31,144,38],[144,40,144,44],[144,46,144,48],[146,1,146,7],[146,28,146,34],[147,1,147,7],[147,28,147,34],[148,1,148,7],[148,28,148,34],[153,45,153,46],[156,40,157,45],[156,46,157,46],[158,40,158,45],[158,46,158,48],[161,16,161,37],[163,1,163,3],[163,4,163,7],[163,12,163,15],[163,16,163,19],[163,36,163,37],[163,42,163,52],[165,1,165,6],[165,28,165,36],[167,1,167,5],[167,6,167,24],[167,28,167,32],[167,33,167,51],[169,4,169,11],[169,13,169,17],[169,19,169,21],[169,23,169,25],[169,31,169,38],[169,40,169,44],[169,46,169,48],[169,50,169,52],[170,1,170,3],[170,4,170,11],[170,13,170,17],[170,19,170,21],[170,28,170,30],[170,31,170,38],[170,40,170,44],[170,46,170,48],[172,1,172,3],[172,4,172,11],[172,13,172,17],[172,19,172,21],[172,23,174,25],[172,28,172,30],[172,31,172,38],[172,40,172,44],[172,46,172,48],[172,50,174,52],[174,1,174,3],[174,4,174,11],[174,13,174,17],[174,19,174,21],[174,28,174,30],[174,31,174,38],[174,40,174,44],[174,46,174,48],[176,1,176,3],[176,4,176,11],[176,13,176,17],[176,19,176,21],[176,28,176,30],[176,31,176,38],[176,40,176,44],[176,46,176,48],[178,1,178,3],[178,4,178,11],[178,13,178,17],[178,19,178,21],[178,28,178,30],[178,31,178,38],[178,40,178,44],[178,46,178,48],[180,1,180,3],[180,4,180,11],[180,13,180,17],[180,19,180,21],[180,23,182,25],[180,28,180,30],[180,31,180,38],[180,40,180,44],[180,46,180,48],[180,50,182,52],[182,1,182,3],[182,4,182,11],[182,13,182,17],[182,19,182,21],[182,28,182,30],[182,31,182,38],[182,40,182,44],[182,46,182,48],[184,1,184,3],[184,4,184,11],[184,13,184,17],[184,19,184,21],[184,28,184,30],[184,31,184,38],[184,40,184,44],[184,46,184,48],[186,1,186,7],[186,28,186,34],[187,1,187,7],[187,28,187,34],[188,1,188,7],[188,28,188,34],[193,45,193,46],[196,40,197,45],[196,46,197,46],[198,40,198,45],[198,46,198,48],[201,16,201,37],[203,1,203,3],[203,4,203,7],[203,12,203,15],[203,16,203,19],[203,36,203,37],[203,42,203,52],[205,1,205,6],[205,28,205,36],[207,1,207,5],[207,6,207,24],[207,28,207,32],[207,33,207,51],[209,4,209,11],[209,13,209,17],[209,19,209,21],[209,23,209,25],[209,31,209,38],[209,40,209,44],[209,46,209,48],[209,50,209,52],[210,1,210,3],[210,4,210,11],[210,13,210,17],[210,19,210,21],[210,28,210,30],[210,31,210,38],[210,40,210,44],[210,46,210,48],[212,1,212,3],[212,4,212,11],[212,13,212,17],[212,19,212,21],[212,23,214,25],[212,28,212,30],[212,31,212,38],[212,40,212,44],[212,46,212,48],[212,50,214,52],[214,1,214,3],[214,4,214,11],[214,13,214,17],[214,19,214,21],[214,28,214,30],[214,31,214,38],[214,40,214,44],[214,46,214,48],[216,1,216,3],[216,4,216,11],[216,13,216,17],[216,19,216,21],[216,28,216,30],[216,31,216,38],[216,40,216,44],[216,46,216,48],[218,1,218,3],[218,4,218,11],[218,13,218,17],[218,19,218,21],[218,28,218,30],[218,31,218,38],[218,40,218,44],[218,46,218,48],[220,1,220,3],[220,4,220,11],[220,13,220,17],[220,19,220,21],[220,23,222,25],[220,28,220,30],[220,31,220,38],[220,40,220,44],[220,46,220,48],[220,50,222,52],[222,1,222,3],[222,4,222,11],[222,13,222,17],[222,19,222,21],[222,28,222,30],[222,31,222,38],[222,40,222,44],[222,46,222,48],[224,1,224,3],[224,4,224,11],[224,13,224,17],[224,19,224,21],[224,28,224,30],[224,31,224,38],[224,40,224,44],[224,46,224,48],[226,1,226,7],[226,28,226,34],[227,1,227,7],[227,28,227,34],[228,1,228,7],[228,28,228,34],[236,40,237,45],[236,46,237,46],[238,40,238,45],[238,46,238,48]]}
[]
[{"$nulls":16},"DISTRICT PENNANT RESULT SHEET"]
[]
[null,"GRADE:",null,null,{"$f":"Results!$D$3","v":1},{"$nulls":7},"SECTION:",{"$nulls":3},{"$f":"Results!$K$3","v":1},{"$nulls":14},"ROUND No.",{"$nulls":4},{"$f":"Results!$R$3","v":2},null,null,"DATE:",null,null,{"$f":"'PENNANT TEAMS'!$B$4","v":"3rd March"}]
[]
[null,"HOME SIDE",{"$nulls":26},"VISITING SIDE"]
[]
[null,"Club Name:",{"$nulls":4},{"$f":"Results!$D$5","v":"Avoca"},{"$nulls":21},"Club Name:",{"$nulls":4},{"$f":"Results!$T$5","v":"Your club name here"}]
[]
[{"$nulls":4},"Players Full Name",{"$nulls":8},"Registration No.",{"$nulls":5},"Grade",{"$nulls":3},"Score",{"$nulls":7},"Players Full Name",{"$nulls":8},"Registration No.",{"$nulls":5},"Grade",{"$nulls":3},"Score"]
[null,"Lead:",null,null,{"$f":"Results!$C$7","v":""},{"$nulls":8},{"$f":"Results!$L$7","v":""},{"$nulls":5},{"$f":"VLOOKUP(N11,'PENNANT TEAMS'!$C$131:$D$331,2,FALSE)","v":{"$error":"#N/A"}},{"$nulls":8},"Lead:",null,null,{"$f":"Results!$S$7","v":0},{"$nulls":8},{"$f":"Results!$AB$7","v":""},{"$nulls":5},{"$f":"VLOOKUP(AO11,'PENNANT TEAMS'!$C$131:$D$331,2,FALSE)","v":{"$error":"#N/A"}}]
[]
[null,"Second:",null,null,{"$f":"Results!$C$8","v":""},{"$nulls":8},{"$f":"Results!$L$8","v":""},{"$nulls":5},{"$f":"VLOOKUP(N13,'PENNANT TEAMS'!$C$131:$D$331,2,FALSE)","v":{"$error":"#N/A"}},{"$nulls":8},"Second:",null,null,{"$f":"Results!$S$8","v":0},{"$nulls":8},{"$f":"Results!$AB$8","v":""},{"$nulls":5},{"$f":"VLOOKUP(AO13,'PENNANT TEAMS'!$C$131:$D$331,2,FALSE)","v":{"$error":"#N/A"}}]
[]
[null,"Third:",null,null,{"$f":"Results!$C$9","v":""},{"$nulls":8},{"$f":"Results!$L$9","v":""},{"$nulls":5},{"$f":"VLOOKUP(N15,'PENNANT TEAMS'!$C$131:$D$331,2,FALSE)","v":{"$error":"#N/A"}},{"$nulls":8},"Third:",null,null,{"$f":"Results!$S$9","v":0},{"$nulls":8},{"$f":"Results!$AB$9","v":""},{"$nulls":5},{"$f":"VLOOKUP(AO15,'PENNANT TEAMS'!$C$131:$D$331,2,FALSE)","v":{"$error":"#N/A"}}]
[]
[null,"Skip:",null,null,{"$f":"Results!$C$10","v":""},{"$nulls":8},{"$f":"Results!$L$10","v":""},{"$nulls":5},{"$f":"VLOOKUP(N17,'PENNANT TEAMS'!$C$131:$D$331,2,FALSE)","v":{"$error":"#N/A"}},{"$nulls":8},"Skip:",null,null,{"$f":"Results!$S$10","v":0},{"$nulls":8},{"$f":"Results!$AB$10","v":""},{"$nulls":5},{"$f":"VLOOKUP(AO17,'PENNANT TEAMS'!$C$131:$D$331,2,FALSE)","v":{"$error":"#N/A"}}]
[]
[null,"Lead:",null,null,{"$f":"Results!$C$11","v":""},{"$nulls":8},{"$f":"Results!$L$11","v":""},{"$nulls":5},{"$f":"VLOOKUP(N19,'PENNANT TEAMS'!$C$131:$D$331,2,FALSE)","v":{"$error":"#N/A"}},{"$nulls":8},"Lead:",null,null,{"$f":"Results!$S$11","v":0},{"$nulls":8},{"$f":"Results!$AB$11","v":""},{"$nulls":5},{"$f":"VLOOKUP(AO19,'PENNANT TEAMS'!$C$131:$D$331,2,FALSE)","v":{"$error":"#N/A"}}]
[]
[null,"Second:",null,null,{"$f":"Results!$C$12","v":""},{"$nulls":8},{"$f":"Results!$L$12","v":""},{"$nulls":5},{"$f":"VLOOKUP(N21,'PENNANT TEAMS'!$C$131:$D$331,2,FALSE)","v":{"$error":"#N/A"}},{"$nulls":8},"Second:",null,null,{"$f":"Results!$S$12","v":0},{"$nulls":8},{"$f":"Results!$AB$12","v":""},{"$nulls":5},{"$f":"VLOOKUP(AO21,'PENNANT TEAMS'!$C$131:$D$331,2,FALSE)","v":{"$error":"#N/A"}}]
[]
[null,"Third:",null,null,{"$f":"Results!$C$13","v":""},{"$nulls":8},{"$f":"Results!$L$13","v":""},{"$nulls":5},{"$f":"VLOOKUP(N23,'PENNANT TEAMS'!$C$131:$D$331,2,FALSE)","v":{"$error":"#N/A"}},{"$nulls":8},"Third:",null,null,{"$f":"Results!$S$13","v":0},{"$nulls":8},{"$f":"Results!$AB$13","v":""},{"$nulls":5},{"$f":"VLOOKUP(AO23,'PENNANT TEAMS'!$C$131:$D$331,2,FALSE)","v":{"$error":"#N/A"}}]
[]
[null,"Skip:",null,null,{"$f":"Results!$C$14","v":""},{"$nulls":8},{"$f":"Results!$L$14","v":""},{"$nulls":5},{"$f":"VLOOKUP(N25,'PENNANT TEAMS'!$C$131:$D$331,2,FALSE)","v":{"$error":"#N/A"}},{"$nulls":8},"Skip:",null,null,{"$f":"Results!$S$14","v":0},{"$nulls":8},{"$f":"Results!$AB$14","v":""},{"$nulls":5},{"$f":"VLOOKUP(AO25,'PENNANT TEAMS'!$C$131:$D$331,2,FALSE)","v":{"$error":"#N/A"}}]
[]
[null,"Rink Wins / Draw",{"$nulls":26},"Rink Wins / Draw"]
[null,"Match Points",{"$nulls":15},"Total Score",{"$nulls":10},"Match Points",{"$nulls":15},"Total Score"]
[null,"Total Points",{"$nulls":26},"Total Points"]
[]
[]
[{"$nulls":40},"Maximum Points Available = 5"]
[]
[{"$nulls":40},"Rink Wins = ",{"$nulls":4},1]
[]
[null,"Name of Winning Club:",{"$nulls":38},"Rink Draws = ",{"$nulls":4},"½"]
[{"$nulls":40},"Match Wins = ",{"$nulls":5},3]
[null,"Signature & Registration No. of Home Side Manager:",{"$nulls":31},0.5]
[{"$nulls":40},"Match draw = ",{"$nulls":5},"1½"]
[null,"Signature & Registration of Visiting Side Manager:"]
[]
[{"$nulls":16},"DISTRICT PENNANT RESULT SHEET"]
[]
[null,"GRADE:",null,null,{"$f":"Results!$D$28","v":2},{"$nulls":7},"SECTION:",{"$nulls":3},{"$f":"Results!$K$28","v":2},{"$nulls":14},"ROUND No.",{"$nulls":4},{"$f":"Results!$R$3","v":2},null,null,"DATE:",null,null,{"$f":"'PENNANT TEAMS'!$B$4","v":"3rd March"}]
[]
[null,"HOME SIDE",{"$nulls":26},"VISITING SIDE"]
[]
[null,"Club Name:",{"$nulls":4},{"$f":"Results!$D$30","v":"The Entrance"},{"$nulls":21},"Club Name:",{"$nulls":4},{"$f":"Results!$T$30","v":"Your club name here"}]
[]
[{"$nulls":4},"Players Full Name",{"$nulls":8},"Registration No.",{"$nulls":5},"Grade",{"$nulls":3},"Score",{"$nulls":7},"Players Full Name",{"$nulls":8},"Registration No.",{"$nulls":5},"Grade",{"$nulls":3},"Score"]
[null,"Lead:",null,null,{"$f":"Results!$C$32","v":""},{"$nulls":8},{"$f":"Results!$L$32","v":""},{"$nulls":5},{"$f":"VLOOKUP(N51,'PENNANT TEAMS'!$C$131:$D$331,2,FALSE)","v":{"$error":"#N/A"}},{"$nulls":8},"Lead:",null,null,{"$f":"Results!$S$32","v":0},{"$nulls":8},{"$f":"Results!$AB$32","v":""},{"$nulls":5},{"$f":"VLOOKUP(AO51,'PENNANT TEAMS'!$C$131:$D$331,2,FALSE)","v":{"$error":"#N/A"}}]
[]
[null,"Second:",null,null,{"$f":"Results!$C$33","v":""},{"$nulls":8},{"$f":"Results!$L$33","v":""},{"$nulls":5},{"$f":"VLOOKUP(N53,'PENNANT TEAMS'!$C$131:$D$331,2,FALSE)","v":{"$error":"#N/A"}},{"$nulls":8},"Second:",null,null,{"$f":"Results!$S$33","v":0},{"$nulls":8},{"$f":"Results!$AB$33","v":""},{"$nulls":5},{"$f":"VLOOKUP(AO53,'PENNANT TEAMS'!$C$131:$D$331,2,FALSE)","v":{"$error":"#N/A"}}]
[]
[null,"Third:",null,null,{"$f":"Results!$C$34","v":""},{"$nulls":8},{"$f":"Results!$L$34","v":""},{"$nulls":5},{"$f":"VLOOKUP(N55,'PENNANT TEAMS'!$C$131:$D$331,2,FALSE)","v":{"$error":"#N/A"}},{"$nulls":8},"Third:",null,null,{"$f":"Results!$S$34","v":0},{"$nulls":8},{"$f":"Results!$AB$34","v":""},{"$nulls":5},{"$f":"VLOOKUP(AO55,'PENNANT TEAMS'!$C$131:$D$331,2,FALSE)","v":{"$error":"#N/A"}}]
[]
[null,"Skip:",null,null,{"$f":"Results!$C$35","v":""},{"$nulls":8},{"$f":"Results!$L$35","v":""},{"$nulls":5},{"$f":"VLOOKUP(N57,'PENNANT TEAMS'!$C$131:$D$331,2,FALSE)","v":{"$error":"#N/A"}},{"$nulls":8},"Skip:",null,null,{"$f":"Results!$S$35","v":0},{"$nulls":8},{"$f":"Results!$AB$35","v":""},{"$nulls":5},{"$f":"VLOOKUP(AO57,'PENNANT TEAMS'!$C$131:$D$331,2,FALSE)","v":{"$error":"#N/A"}}]
[]
[null,"Lead:",null,null,{"$f":"Results!$C$36","v":""},{"$nulls":8},{"$f":"Results!$L$36","v":""},{"$nulls":5},{"$f":"VLOOKUP(N59,'PENNANT TEAMS'!$C$131:$D$331,2,FALSE)","v":{"$error":"#N/A"}},{"$nulls":8},"Lead:",null,null,{"$f":"Results!$S$36","v":0},{"$nulls":8},{"$f":"Results!$AB$36","v":""},{"$nulls":5},{"$f":"VLOOKUP(AO59,'PENNANT TEAMS'!$C$131:$D$331,2,FALSE)","v":{"$error":"#N/A"}}]
[]
[null,"Second:",null,null,{"$f":"Results!$C$37","v":""},{"$nulls":8},{"$f":"Results!$L$37","v":""},{"$nulls":5},{"$f":"VLOOKUP(N61,'PENNANT TEAMS'!$C$131:$D$331,2,FALSE)","v":{"$error":"#N/A"}},{"$nulls":8},"Second:",null,null,{"$f":"Results!$S$37","v":0},{"$nulls":8},{"$f":"Results!$AB$37","v":""},{"$nulls":5},{"$f":"VLOOKUP(AO61,'PENNANT TEAMS'!$C$131:$D$331,2,FALSE)","v":{"$error":"#N/A"}}]
[]
[null,"Third:",null,null,{"$f":"Results!$C$38","v":""},{"$nulls":8},{"$f":"Results!$L$38","v":""},{"$nulls":5},{"$f":"VLOOKUP(N63,'PENNANT TEAMS'!$C$131:$D$331,2,FALSE)","v":{"$error":"#N/A"}},{"$nulls":8},"Third:",null,null,{"$f":"Results!$S$38","v":0},{"$nulls":8},{"$f":"Results!$AB$38","v":""},{"$nulls":5},{"$f":"VLOOKUP(AO63,'PENNANT TEAMS'!$C$131:$D$331,2,FALSE)","v":{"$error":"#N/A"}}]
[]
[null,"Skip:",null,null,{"$f":"Results!$C$39","v":""},{"$nulls":8},{"$f":"Results!$L$39","v":""},{"$nulls":5},{"$f":"VLOOKUP(N65,'PENNANT TEAMS'!$C$131:$D$331,2,FALSE)","v":{"$error":"#N/A"}},{"$nulls":8},"Skip:",null,null,{"$f":"Results!$S$39","v":0},{"$nulls":8},{"$f":"Results!$AB$39","v":""},{"$nulls":5},{"$f":"VLOOKUP(AO65,'PENNANT TEAMS'!$C$131:$D$331,2,FALSE)","v":{"$error":"#N/A"}}]
[]
[null,"Rink Wins / Draw",{"$nulls":26},"Rink Wins / Draw"]
[null,"Match Points",{"$nulls":15},"Total Score",{"$nulls":10},"Match Points",{"$nulls":15},"Total Score"]
[null,"Total Points",{"$nulls":26},"Total Points"]
[]
[]
[{"$nulls":40},"Maximum Points Available = 5"]
[]
[{"$nulls":40},"Rink Wins = ",{"$nulls":4},1]
[]
[null,"Name of Winning Club:",{"$nulls":38},"Rink Draws = ",{"$nulls":4},"½"]
[{"$nulls":40},"Match Wins = ",{"$nulls":5},3]
[null,"Signature & Registration No. of Home Side Manager:",{"$nulls":31},0.5]
[{"$nulls":40},"Match draw = ",{"$nulls":5},"1½"]
[null,"Signature & Registration of Visiting Side Manager:"]
[]
[{"$nulls":16},"DISTRICT PENNANT RESULT SHEET"]
[]
[null,"GRADE:",null,null,{"$f":"Results!$D$53","v":3.1},{"$nulls":7},"SECTION:",{"$nulls":3},{"$f":"Results!$K$53","v":1},{"$nulls":14},"ROUND No.",{"$nulls":4},{"$f":"Results!$R$3","v":2},null,null,"DATE:",null,null,{"$f":"'PENNANT TEAMS'!$B$4","v":"3rd March"}]
[]
[null,"HOME SIDE",{"$nulls":26},"VISITING SIDE"]
[]
[null,"Club Name:",{"$nulls":4},{"$f":"Results!$D$55","v":"Your club name here"},{"$nulls":21},"Club Name:",{"$nulls":4},{"$f":"Results!$T$55","v":"Bateau Bay"}]
[]
[{"$nulls":4},"Players Full Name",{"$nulls":8},"Registration No.",{"$nulls":5},"Grade",{"$nulls":3},"Score",{"$nulls":7},"Players Full Name",{"$nulls":8},"Registration No.",{"$nulls":5},"Grade",{"$nulls":3},"Score"]
[null,"Lead:",null,null,{"$f":"Results!$C$57","v":0},{"$nulls":8},{"$f":"Results!$L$57","v":""},{"$nulls":5},{"$f":"VLOOKUP(N91,'PENNANT TEAMS'!$C$131:$D$331,2,FALSE)","v":{"$error":"#N/A"}},{"$nulls":8},"Lead:",null,null,{"$f":"Results!$S$57","v":""},{"$nulls":8},{"$f":"Results!$AB$57","v":""},{"$nulls":5},{"$f":"VLOOKUP(AO91,'PENNANT TEAMS'!$C$131:$D$331,2,FALSE)","v":{"$error":"#N/A"}}]
[]
[null,"Second:",null,null,{"$f":"Results!$C$58","v":0},{"$nulls":8},{"$f":"Results!$L$58","v":""},{"$nulls":5},{"$f":"VLOOKUP(N93,'PENNANT TEAMS'!$C$131:$D$331,2,FALSE)","v":{"$error":"#N/A"}},{"$nulls":8},"Second:",null,null,{"$f":"Results!$S$58","v":""},{"$nulls":8},{"$f":"Results!$AB$58","v":""},{"$nulls":5},{"$f":"VLOOKUP(AO93,'PENNANT TEAMS'!$C$131:$D$331,2,FALSE)","v":{"$error":"#N/A"}}]
[]
[null,"Third:",null,null,{"$f":"Results!$C$59","v":0},{"$nulls":8},{"$f":"Results!$L$59","v":""},{"$nulls":5},{"$f":"VLOOKUP(N95,'PENNANT TEAMS'!$C$131:$D$331,2,FALSE)","v":{"$error":"#N/A"}},{"$nulls":8},"Third:",null,null,{"$f":"Results!$S$59","v":""},{"$nulls":8},{"$f":"Results!$AB$59","v":""},{"$nulls":5},{"$f":"VLOOKUP(AO95,'PENNANT TEAMS'!$C$131:$D$331,2,FALSE)","v":{"$error":"#N/A"}}]
[]
[null,"Skip:",null,null,{"$f":"Results!$C$60","v":0},{"$nulls":8},{"$f":"Results!$L$60","v":""},{"$nulls":5},{"$f":"VLOOKUP(N97,'PENNANT TEAMS'!$C$131:$D$331,2,FALSE)","v":{"$error":"#N/A"}},{"$nulls":8},"Skip:",null,null,{"$f":"Results!$S$60","v":""},{"$nulls":8},{"$f":"Results!$AB$60","v":""},{"$nulls":5},{"$f":"VLOOKUP(AO97,'PENNANT TEAMS'!$C$131:$D$331,2,FALSE)","v":{"$error":"#N/A"}}]
[]
[null,"Lead:",null,null,{"$f":"Results!$C$61","v":0},{"$nulls":8},{"$f":"Results!$L$61","v":""},{"$nulls":5},{"$f":"VLOOKUP(N99,'PENNANT TEAMS'!$C$131:$D$331,2,FALSE)","v":{"$error":"#N/A"}},{"$nulls":8},"Lead:",null,null,{"$f":"Results!$S$61","v":""},{"$nulls":8},{"$f":"Results!$AB$61","v":""},{"$nulls":5},{"$f":"VLOOKUP(AO99,'PENNANT TEAMS'!$C$131:$D$331,2,FALSE)","v":{"$error":"#N/A"}}]
[]
[null,"Second:",null,null,{"$f":"Results!$C$62","v":0},{"$nulls":8},{"$f":"Results!$L$62","v":""},{"$nulls":5},{"$f":"VLOOKUP(N101,'PENNANT TEAMS'!$C$131:$D$331,2,FALSE)","v":{"$error":"#N/A"}},{"$nulls":8},"Second:",null,null,{"$f":"Results!$S$62","v":""},{"$nulls":8},{"$f":"Results!$AB$62","v":""},{"$nulls":5},{"$f":"VLOOKUP(AO101,'PENNANT TEAMS'!$C$131:$D$331,2,FALSE)","v":{"$error":"#N/A"}}]
[]
[null,"Third:",null,null,{"$f":"Results!$C$63","v":0},{"$nulls":8},{"$f":"Results!$L$63","v":""},{"$nulls":5},{"$f":"VLOOKUP(N103,'PENNANT TEAMS'!$C$131:$D$331,2,FALSE)","v":{"$error":"#N/A"}},{"$nulls":8},"Third:",null,null,{"$f":"Results!$S$63","v":""},{"$nulls":8},{"$f":"Results!$AB$63","v":""},{"$nulls":5},{"$f":"VLOOKUP(AO103,'PENNANT TEAMS'!$C$131:$D$331,2,FALSE)","v":{"$error":"#N/A"}}]
[]
[null,"Skip:",null,null,{"$f":"Results!$C$64","v":0},{"$nulls":8},{"$f":"Results!$L$64","v":""},{"$nulls":5},{"$f":"VLOOKUP(N105,'PENNANT TEAMS'!$C$131:$D$331,2,FALSE)","v":{"$error":"#N/A"}},{"$nulls":8},"Skip:",null,null,{"$f":"Results!$S$64","v":""},{"$nulls":8},{"$f":"Results!$AB$64","v":""},{"$nulls":5},{"$f":"VLOOKUP(AO105,'PENNANT TEAMS'!$C$131:$D$331,2,FALSE)","v":{"$error":"#N/A"}}]
[]
[null,"Rink Wins / Draw",{"$nulls":26},"Rink Wins / Draw"]
[null,"Match Points",{"$nulls":15},"Total Score",{"$nulls":10},"Match Points",{"$nulls":15},"Total Score"]
[null,"Total Points",{"$nulls":26},"Total Points"]
[]
[]
[{"$nulls":40},"Maximum Points Available = 5"]
[]
[{"$nulls":40},"Rink Wins = ",{"$nulls":4},1]
[]
[null,"Name of Winning Club:",{"$nulls":38},"Rink Draws = ",{"$nulls":4},"½"]
[{"$nulls":40},"Match Wins = ",{"$nulls":5},3]
[null,"Signature & Registration No. of Home Side Manager:",{"$nulls":31},0.5]
[{"$nulls":40},"Match draw = ",{"$nulls":5},"1½"]
[null,"Signature & Registration of Visiting Side Manager:"]
[]
[{"$nulls":16},"DISTRICT PENNANT RESULT SHEET"]
[]
[null,"GRADE:",null,null,{"$f":"Results!$D$78","v":3.2},{"$nulls":7},"SECTION:",{"$nulls":3},{"$f":"Results!$K$78","v":2},{"$nulls":14},"ROUND No.",{"$nulls":4},{"$f":"Results!$R$3","v":2},null,null,"DATE:",null,null,{"$f":"'PENNANT TEAMS'!$B$4","v":"3rd March"}]
[]
[null,"HOME SIDE",{"$nulls":26},"VISITING SIDE"]
[]
[null,"Club Name:",{"$nulls":4},{"$f":"Results!$D$80","v":"Wyong"},{"$nulls":21},"Club Name:",{"$nulls":4},{"$f":"Results!$T$80","v":"Your club name here"}]
[]
[{"$nulls":4},"Players Full Name",{"$nulls":8},"Registration No.",{"$nulls":5},"Grade",{"$nulls":3},"Score",{"$nulls":7},"Players Full Name",{"$nulls":8},"Registration No.",{"$nulls":5},"Grade",{"$nulls":3},"Score"]
[null,"Lead:",null,null,{"$f":"Results!$C$82","v":""},{"$nulls":8},{"$f":"Results!$L$82","v":""},{"$nulls":5},{"$f":"VLOOKUP(N131,'PENNANT TEAMS'!$C$131:$D$331,2,FALSE)","v":{"$error":"#N/A"}},{"$nulls":8},"Lead:",null,null,{"$f":"Results!$S$82","v":0},{"$nulls":8},{"$f":"Results!$AB$82","v":""},{"$nulls":5},{"$f":"VLOOKUP(AO131,'PENNANT TEAMS'!$C$131:$D$331,2,FALSE)","v":{"$error":"#N/A"}}]
[]
[null,"Second:",null,null,{"$f":"Results!$C$83","v":""},{"$nulls":8},{"$f":"Results!$L$83","v":""},{"$nulls":5},{"$f":"VLOOKUP(N133,'PENNANT TEAMS'!$C$131:$D$331,2,FALSE)","v":{"$error":"#N/A"}},{"$nulls":8},"Second:",null,null,{"$f":"Results!$S$83","v":0},{"$nulls":8},{"$f":"Results!$AB$83","v":""},{"$nulls":5},{"$f":"VLOOKUP(AO133,'PENNANT TEAMS'!$C$131:$D$331,2,FALSE)","v":{"$error":"#N/A"}}]
[]
[null,"Third:",null,null,{"$f":"Results!$C$84","v":""},{"$nulls":8},{"$f":"Results!$L$84","v":""},{"$nulls":5},{"$f":"VLOOKUP(N135,'PENNANT TEAMS'!$C$131:$D$331,2,FALSE)","v":{"$error":"#N/A"}},{"$nulls":8},"Third:",null,null,{"$f":"Results!$S$84","v":0},{"$nulls":8},{"$f":"Results!$AB$84","v":""},{"$nulls":5},{"$f":"VLOOKUP(AO135,'PENNANT TEAMS'!$C$131:$D$331,2,FALSE)","v":{"$error":"#N/A"}}]
[]
[null,"Skip:",null,null,{"$f":"Results!$C$85","v":""},{"$nulls":8},{"$f":"Results!$L$85","v":""},{"$nulls":5},{"$f":"VLOOKUP(N137,'PENNANT TEAMS'!$C$131:$D$331,2,FALSE)","v":{"$error":"#N/A"}},{"$nulls":8},"Skip:",null,null,{"$f":"Results!$S$85","v":0},{"$nulls":8},{"$f":"Results!$AB$85","v":""},{"$nulls":5},{"$f":"VLOOKUP(AO137,'PENNANT TEAMS'!$C$131:$D$331,2,FALSE)","v":{"$error":"#N/A"}}]
[]
[null,"Lead:",null,null,{"$f":"Results!$C$86","v":""},{"$nulls":8},{"$f":"Results!$L$86","v":""},{"$nulls":5},{"$f":"VLOOKUP(N139,'PENNANT TEAMS'!$C$131:$D$331,2,FALSE)","v":{"$error":"#N/A"}},{"$nulls":8},"Lead:",null,null,{"$f":"Results!$S$86","v":0},{"$nulls":8},{"$f":"Results!$AB$86","v":""},{"$nulls":5},{"$f":"VLOOKUP(AO139,'PENNANT TEAMS'!$C$131:$D$331,2,FALSE)","v":{"$error":"#N/A"}}]
[]
[null,"Second:",null,null,{"$f":"Results!$C$87","v":""},{"$nulls":8},{"$f":"Results!$L$87","v":""},{"$nulls":5},{"$f":"VLOOKUP(N141,'PENNANT TEAMS'!$C$131:$D$331,2,FALSE)","v":{"$error":"#N/A"}},{"$nulls":8},"Second:",null,null,{"$f":"Results!$S$87","v":0},{"$nulls":8},{"$f":"Results!$AB$87","v":""},{"$nulls":5},{"$f":"VLOOKUP(AO141,'PENNANT TEAMS'!$C$131:$D$331,2,FALSE)","v":{"$error":"#N/A"}}]
[]
[null,"Third:",null,null,{"$f":"Results!$C$88","v":""},{"$nulls":8},{"$f":"Results!$L$88","v":""},{"$nulls":5},{"$f":"VLOOKUP(N143,'PENNANT TEAMS'!$C$131:$D$331,2,FALSE)","v":{"$error":"#N/A"}},{"$nulls":8},"Third:",null,null,{"$f":"Results!$S$88","v":0},{"$nulls":8},{"$f":"Results!$AB$88","v":""},{"$nulls":5},{"$f":"VLOOKUP(AO143,'PENNANT TEAMS'!$C$131:$D$331,2,FALSE)","v":{"$error":"#N/A"}}]
[]
[null,"Skip:",null,null,{"$f":"Results!$C$89","v":""},{"$nulls":8},{"$f":"Results!$L$89","v":""},{"$nulls":5},{"$f":"VLOOKUP(N145,'PENNANT TEAMS'!$C$131:$D$331,2,FALSE)","v":{"$error":"#N/A"}},{"$nulls":8},"Skip:",null,null,{"$f":"Results!$S$89","v":0},{"$nulls":8},{"$f":"Results!$AB$89","v":""},{"$nulls":5},{"$f":"VLOOKUP(AO145,'PENNANT TEAMS'!$C$131:$D$331,2,FALSE)","v":{"$error":"#N/A"}}]
[]
[null,"Rink Wins / Draw",{"$nulls":26},"Rink Wins / Draw"]
[null,"Match Points",{"$nulls":15},"Total Score",{"$nulls":10},"Match Points",{"$nulls":15},"Total Score"]
[null,"Total Points",{"$nulls":26},"Total Points"]
[]
[]
[{"$nulls":40},"Maximum Points Available = 5"]
[]
[{"$nulls":40},"Rink Wins = ",{"$nulls":4},1]
[]
[null,"Name of Winning Club:",{"$nulls":38},"Rink Draws = ",{"$nulls":4},"½"]
[{"$nulls":40},"Match Wins = ",{"$nulls":5},3]
[null,"Signature & Registration No. of Home Side Manager:",{"$nulls":31},0.5]
[{"$nulls":40},"Match draw = ",{"$nulls":5},"1½"]
[null,"Signature & Registration of Visiting Side Manager:"]
[]
[{"$nulls":16},"DISTRICT PENNANT RESULT SHEET"]
[]
[null,"GRADE:",null,null,{"$f":"Results!$D$103","v":4.1},{"$nulls":7},"SECTION:",{"$nulls":3},{"$f":"Results!$K$103","v":1},{"$nulls":14},"ROUND No.",{"$nulls":4},{"$f":"Results!$R$3","v":2},null,null,"DATE:",null,null,{"$f":"'PENNANT TEAMS'!$B$4","v":"3rd March"}]
[]
[null,"HOME SIDE",{"$nulls":26},"VISITING SIDE"]
[]
[null,"Club Name:",{"$nulls":4},{"$f":"Results!$D$105","v":"Davistown"},{"$nulls":21},"Club Name:",{"$nulls":4},{"$f":"Results!$T$105","v":"Your club name here"}]
[]
[{"$nulls":4},"Players Full Name",{"$nulls":8},"Registration No.",{"$nulls":5},"Grade",{"$nulls":3},"Score",{"$nulls":7},"Players Full Name",{"$nulls":8},"Registration No.",{"$nulls":5},"Grade",{"$nulls":3},"Score"]
[null,"Lead:",null,null,{"$f":"Results!$C$107","v":""},{"$nulls":8},{"$f":"Results!$L$107","v":""},{"$nulls":5},{"$f":"VLOOKUP(N171,'PENNANT TEAMS'!$C$131:$D$331,2,FALSE)","v":{"$error":"#N/A"}},{"$nulls":8},"Lead:",null,null,{"$f":"Results!$S$107","v":0},{"$nulls":8},{"$f":"Results!$AB$107","v":""},{"$nulls":5},{"$f":"VLOOKUP(AO171,'PENNANT TEAMS'!$C$131:$D$331,2,FALSE)","v":{"$error":"#N/A"}}]
[]
[null,"Second:",null,null,{"$f":"Results!$C$108","v":""},{"$nulls":8},{"$f":"Results!$L$108","v":""},{"$nulls":5},{"$f":"VLOOKUP(N173,'PENNANT TEAMS'!$C$131:$D$331,2,FALSE)","v":{"$error":"#N/A"}},{"$nulls":8},"Second:",null,null,{"$f":"Results!$S$108","v":0},{"$nulls":8},{"$f":"Results!$AB$108","v":""},{"$nulls":5},{"$f":"VLOOKUP(AO173,'PENNANT TEAMS'!$C$131:$D$331,2,FALSE)","v":{"$error":"#N/A"}}]
[]
[null,"Third:",null,null,{"$f":"Results!$C$109","v":""},{"$nulls":8},{"$f":"Results!$L$109","v":""},{"$nulls":5},{"$f":"VLOOKUP(N175,'PENNANT TEAMS'!$C$131:$D$331,2,FALSE)","v":{"$error":"#N/A"}},{"$nulls":8},"Third:",null,null,{"$f":"Results!$S$109","v":0},{"$nulls":8},{"$f":"Results!$AB$109","v":""},{"$nulls":5},{"$f":"VLOOKUP(AO175,'PENNANT TEAMS'!$C$131:$D$331,2,FALSE)","v":{"$error":"#N/A"}}]
[]
[null,"Skip:",null,null,{"$f":"Results!$C$110","v":""},{"$nulls":8},{"$f":"Results!$L$110","v":""},{"$nulls":5},{"$f":"VLOOKUP(N177,'PENNANT TEAMS'!$C$131:$D$331,2,FALSE)","v":{"$error":"#N/A"}},{"$nulls":8},"Skip:",null,null,{"$f":"Results!$S$110","v":0},{"$nulls":8},{"$f":"Results!$AB$110","v":""},{"$nulls":5},{"$f":"VLOOKUP(AO177,'PENNANT TEAMS'!$C$131:$D$331,2,FALSE)","v":{"$error":"#N/A"}}]
[]
[null,"Lead:",null,null,{"$f":"Results!$C$111","v":""},{"$nulls":8},{"$f":"Results!$L$111","v":""},{"$nulls":5},{"$f":"VLOOKUP(N179,'PENNANT TEAMS'!$C$131:$D$331,2,FALSE)","v":{"$error":"#N/A"}},{"$nulls":8},"Lead:",null,null,{"$f":"Results!$S$111","v":0},{"$nulls":8},{"$f":"Results!$AB$111","v":""},{"$nulls":5},{"$f":"VLOOKUP(AO179,'PENNANT TEAMS'!$C$131:$D$331,2,FALSE)","v":{"$error":"#N/A"}}]
[]
[null,"Second:",null,null,{"$f":"Results!$C$112","v":""},{"$nulls":8},{"$f":"Results!$L$112","v":""},{"$nulls":5},{"$f":"VLOOKUP(N181,'PENNANT TEAMS'!$C$131:$D$331,2,FALSE)","v":{"$error":"#N/A"}},{"$nulls":8},"Second:",null,null,{"$f":"Results!$S$112","v":0},{"$nulls":8},{"$f":"Results!$AB$112","v":""},{"$nulls":5},{"$f":"VLOOKUP(AO181,'PENNANT TEAMS'!$C$131:$D$331,2,FALSE)","v":{"$error":"#N/A"}}]
[]
[null,"Third:",null,null,{"$f":"Results!$C$113","v":""},{"$nulls":8},{"$f":"Results!$L$113","v":""},{"$nulls":5},{"$f":"VLOOKUP(N183,'PENNANT TEAMS'!$C$131:$D$331,2,FALSE)","v":{"$error":"#N/A"}},{"$nulls":8},"Third:",null,null,{"$f":"Results!$S$113","v":0},{"$nulls":8},{"$f":"Results!$AB$113","v":""},{"$nulls":5},{"$f":"VLOOKUP(AO183,'PENNANT TEAMS'!$C$131:$D$331,2,FALSE)","v":{"$error":"#N/A"}}]
[]
[null,"Skip:",null,null,{"$f":"Results!$C$114","v":""},{"$nulls":8},{"$f":"Results!$L$114","v":""},{"$nulls":5},{"$f":"VLOOKUP(N185,'PENNANT TEAMS'!$C$131:$D$331,2,FALSE)","v":{"$error":"#N/A"}},{"$nulls":8},"Skip:",null,null,{"$f":"Results!$S$114","v":0},{"$nulls":8},{"$f":"Results!$AB$114","v":""},{"$nulls":5},{"$f":"VLOOKUP(AO185,'PENNANT TEAMS'!$C$131:$D$331,2,FALSE)","v":{"$error":"#N/A"}}]
[]
[null,"Rink Wins / Draw",{"$nulls":26},"Rink Wins / Draw"]
[null,"Match Points",{"$nulls":15},"Total Score",{"$nulls":10},"Match Points",{"$nulls":15},"Total Score"]
[null,"Total Points",{"$nulls":26},"Total Points"]
[]
[]
[{"$nulls":40},"Maximum Points Available = 5"]
[]
[{"$nulls":40},"Rink Wins = ",{"$nulls":4},1]
[]
[null,"Name of Winning Club:",{"$nulls":38},"Rink Draws = ",{"$nulls":4},"½"]
[{"$nulls":40},"Match Wins = ",{"$nulls":5},3]
[null,"Signature & Registration No. of Home Side Manager:",{"$nulls":31},0.5]
[{"$nulls":40},"Match draw = ",{"$nulls":5},"1½"]
[null,"Signature & Registration of Visiting Side Manager:"]
[]
[{"$nulls":16},"DISTRICT PENNANT RESULT SHEET"]
[]
[null,"GRADE:",null,null,{"$f":"Results!$D$128","v":4.2},{"$nulls":7},"SECTION:",{"$nulls":3},{"$f":"Results!$K$128","v":2},{"$nulls":14},"ROUND No.",{"$nulls":4},{"$f":"Results!$R$3","v":2},null,null,"DATE:",null,null,{"$f":"'PENNANT TEAMS'!$B$4","v":"3rd March"}]
[]
[null,"HOME SIDE",{"$nulls":26},"VISITING SIDE"]
[]
[null,"Club Name:",{"$nulls":4},{"$f":"Results!$D$130","v":"Terrigal"},{"$nulls":21},"Club Name:",{"$nulls":4},{"$f":"Results!$T$130","v":"Your club name here"}]
[]
[{"$nulls":4},"Players Full Name",{"$nulls":8},"Registration No.",{"$nulls":5},"Grade",{"$nulls":3},"Score",{"$nulls":7},"Players Full Name",{"$nulls":8},"Registration No.",{"$nulls":5},"Grade",{"$nulls":3},"Score"]
[null,"Lead:",null,null,{"$f":"Results!$C$132","v":""},{"$nulls":8},{"$f":"Results!$L$132","v":""},{"$nulls":5},{"$f":"VLOOKUP(N211,'PENNANT TEAMS'!$C$131:$D$331,2,FALSE)","v":{"$error":"#N/A"}},{"$nulls":8},"Lead:",null,null,{"$f":"Results!$S$132","v":0},{"$nulls":8},{"$f":"Results!$AB$132","v":""},{"$nulls":5},{"$f":"VLOOKUP(AO211,'PENNANT TEAMS'!$C$131:$D$331,2,FALSE)","v":{"$error":"#N/A"}}]
[]
[null,"Second:",null,null,{"$f":"Results!$C$133","v":""},{"$nulls":8},{"$f":"Results!$L$133","v":""},{"$nulls":5},{"$f":"VLOOKUP(N213,'PENNANT TEAMS'!$C$131:$D$331,2,FALSE)","v":{"$error":"#N/A"}},{"$nulls":8},"Second:",null,null,{"$f":"Results!$S$133","v":0},{"$nulls":8},{"$f":"Results!$AB$133","v":""},{"$nulls":5},{"$f":"VLOOKUP(AO213,'PENNANT TEAMS'!$C$131:$D$331,2,FALSE)","v":{"$error":"#N/A"}}]
[]
[null,"Third:",null,null,{"$f":"Results!$C$134","v":""},{"$nulls":8},{"$f":"Results!$L$134","v":""},{"$nulls":5},{"$f":"VLOOKUP(N215,'PENNANT TEAMS'!$C$131:$D$331,2,FALSE)","v":{"$error":"#N/A"}},{"$nulls":8},"Third:",null,null,{"$f":"Results!$S$134","v":0},{"$nulls":8},{"$f":"Results!$AB$134","v":""},{"$nulls":5},{"$f":"VLOOKUP(AO215,'PENNANT TEAMS'!$C$131:$D$331,2,FALSE)","v":{"$error":"#N/A"}}]
[]
[null,"Skip:",null,null,{"$f":"Results!$C$135","v":""},{"$nulls":8},{"$f":"Results!$L$135","v":""},{"$nulls":5},{"$f":"VLOOKUP(N217,'PENNANT TEAMS'!$C$131:$D$331,2,FALSE)","v":{"$error":"#N/A"}},{"$nulls":8},"Skip:",null,null,{"$f":"Results!$S$135","v":0},{"$nulls":8},{"$f":"Results!$AB$135","v":""},{"$nulls":5},{"$f":"VLOOKUP(AO217,'PENNANT TEAMS'!$C$131:$D$331,2,FALSE)","v":{"$error":"#N/A"}}]
[]
[null,"Lead:",null,null,{"$f":"Results!$C$136","v":""},{"$nulls":8},{"$f":"Results!$L$136","v":""},{"$nulls":5},{"$f":"VLOOKUP(N219,'PENNANT TEAMS'!$C$131:$D$331,2,FALSE)","v":{"$error":"#N/A"}},{"$nulls":8},"Lead:",null,null,{"$f":"Results!$S$136","v":0},{"$nulls":8},{"$f":"Results!$AB$136","v":""},{"$nulls":5},{"$f":"VLOOKUP(AO219,'PENNANT TEAMS'!$C$131:$D$331,2,FALSE)","v":{"$error":"#N/A"}}]
[]
[null,"Second:",null,null,{"$f":"Results!$C$137","v":""},{"$nulls":8},{"$f":"Results!$L$137","v":""},{"$nulls":5},{"$f":"VLOOKUP(N221,'PENNANT TEAMS'!$C$131:$D$331,2,FALSE)","v":{"$error":"#N/A"}},{"$nulls":8},"Second:",null,null,{"$f":"Results!$S$137","v":0},{"$nulls":8},{"$f":"Results!$AB$137","v":""},{"$nulls":5},{"$f":"VLOOKUP(AO221,'PENNANT TEAMS'!$C$131:$D$331,2,FALSE)","v":{"$error":"#N/A"}}]
[{"$nulls":40},"."]
[null,"Third:",null,null,{"$f":"Results!$C$138","v":""},{"$nulls":8},{"$f":"Results!$L$138","v":""},{"$nulls":5},{"$f":"VLOOKUP(N223,'PENNANT TEAMS'!$C$131:$D$331,2,FALSE)","v":{"$error":"#N/A"}},{"$nulls":8},"Third:",null,null,{"$f":"Results!$S$138","v":0},{"$nulls":8},{"$f":"Results!$AB$138","v":""},{"$nulls":5},{"$f":"VLOOKUP(AO223,'PENNANT TEAMS'!$C$131:$D$331,2,FALSE)","v":{"$error":"#N/A"}}]
[]
[null,"Skip:",null,null,{"$f":"Results!$C$139","v":""},{"$nulls":8},{"$f":"Results!$L$139","v":""},{"$nulls":5},{"$f":"VLOOKUP(N225,'PENNANT TEAMS'!$C$131:$D$331,2,FALSE)","v":{"$error":"#N/A"}},{"$nulls":8},"Skip:",null,null,{"$f":"Results!$S$139","v":0},{"$nulls":8},{"$f":"Results!$AB$139","v":""},{"$nulls":5},{"$f":"VLOOKUP(AO225,'PENNANT TEAMS'!$C$131:$D$331,2,FALSE)","v":{"$error":"#N/A"}}]
[]
[null,"Rink Wins / Draw",{"$nulls":26},"Rink Wins / Draw"]
[null,"Match Points",{"$nulls":15},"Total Score",{"$nulls":10},"Match Points",{"$nulls":15},"Total Score"]
[null,"Total Points",{"$nulls":26},"Total Points"]
[]
[]
[{"$nulls":40},"Maximum Points Available = 5"]
[]
[{"$nulls":40},"Rink Wins = ",{"$nulls":4},1]
[]
[null,"Name of Winning Club:",{"$nulls":38},"Rink Draws = ",{"$nulls":4},"½"]
[{"$nulls":40},"Match Wins = ",{"$nulls":5},3]
[null,"Signature & Registration No. of Home Side Manager:",{"$nulls":31},0.5]
[{"$nulls":40},"Match draw = ",{"$nulls":5},"1½"]
[null,"Signature & Registration of Visiting Side Manager:"]

{"sheet":"Card Stickers","index":5,"n_rows":31,"n_cols":4,"rows_kept":31}
[{"$f":"'PENNANT TEAMS'!$A$8","v":1},{"$f":"'PENNANT TEAMS'!$A$22","v":3.1},{"$f":"'PENNANT TEAMS'!$A$36","v":4.1},{"$f":"'PENNANT TEAMS'!$A$50","v":7}]
[{"$f":"'PENNANT TEAMS'!$B$8","v":0},{"$f":"'PENNANT TEAMS'!$B$22","v":0},{"$f":"'PENNANT TEAMS'!$B$36","v":0},{"$f":"'PENNANT TEAMS'!$B$50","v":0}]
[{"$f":"'PENNANT TEAMS'!$C$8","v":0},{"$f":"'PENNANT TEAMS'!$C$22","v":0},{"$f":"'PENNANT TEAMS'!$C$36","v":0},{"$f":"'PENNANT TEAMS'!$C$50","v":0}]
[{"$f":"'PENNANT TEAMS'!$D$8","v":0},{"$f":"'PENNANT TEAMS'!$D$22","v":0},{"$f":"'PENNANT TEAMS'!$D$36","v":0},{"$f":"'PENNANT TEAMS'!$D$50","v":0}]
[{"$f":"'PENNANT TEAMS'!$E$8","v":0},{"$f":"'PENNANT TEAMS'!$E$22","v":0},{"$f":"'PENNANT TEAMS'!$E$36","v":0},{"$f":"'PENNANT TEAMS'!$E$50","v":0}]
[]
[{"$f":"'PENNANT TEAMS'!$B$10","v":0},{"$f":"'PENNANT TEAMS'!$B$24","v":0},{"$f":"'PENNANT TEAMS'!$B$38","v":0},{"$f":"'PENNANT TEAMS'!$B$52","v":0}]
[{"$f":"'PENNANT TEAMS'!$C$10","v":0},{"$f":"'PENNANT TEAMS'!$C$24","v":0},{"$f":"'PENNANT TEAMS'!$C$38","v":0},{"$f":"'PENNANT TEAMS'!$C$52","v":0}]
[{"$f":"'PENNANT TEAMS'!$D$10","v":0},{"$f":"'PENNANT TEAMS'!$D$24","v":0},{"$f":"'PENNANT TEAMS'!$D$38","v":0},{"$f":"'PENNANT TEAMS'!$D$52","v":0}]
[{"$f":"'PENNANT TEAMS'!$E$10","v":0},{"$f":"'PENNANT TEAMS'!$E$24","v":0},{"$f":"'PENNANT TEAMS'!$E$38","v":0},{"$f":"'PENNANT TEAMS'!$E$52","v":0}]
[]
[]
[]
[{"$f":"'PENNANT TEAMS'!$A$15","v":2},{"$f":"'PENNANT TEAMS'!$A$29","v":3.2},{"$f":"'PENNANT TEAMS'!$A$43","v":4.2},{"$f":"'PENNANT TEAMS'!$A$57","v":8}]
[{"$f":"'PENNANT TEAMS'!$B$15","v":0},{"$f":"'PENNANT TEAMS'!$B$29","v":0},{"$f":"'PENNANT TEAMS'!$B$43","v":0},{"$f":"'PENNANT TEAMS'!$B$57","v":0}]
[{"$f":"'PENNANT TEAMS'!$C$15","v":0},{"$f":"'PENNANT TEAMS'!$C$29","v":0},{"$f":"'PENNANT TEAMS'!$C$43","v":0},{"$f":"'PENNANT TEAMS'!$C$57","v":0}]
[{"$f":"'PENNANT TEAMS'!$D$15","v":0},{"$f":"'PENNANT TEAMS'!$D$29","v":0},{"$f":"'PENNANT TEAMS'!$D$43","v":0},{"$f":"'PENNANT TEAMS'!$D$57","v":0}]
[{"$f":"'PENNANT TEAMS'!$E$15","v":0},{"$f":"'PENNANT TEAMS'!$E$29","v":0},{"$f":"'PENNANT TEAMS'!$E$43","v":0},{"$f":"'PENNANT TEAMS'!$E$57","v":0}]
[]
[{"$f":"'PENNANT TEAMS'!$B$17","v":0},{"$f":"'PENNANT TEAMS'!$B$31","v":0},{"$f":"'PENNANT TEAMS'!$B$45","v":0},{"$f":"'PENNANT TEAMS'!$B$59","v":0}]
[{"$f":"'PENNANT TEAMS'!$C$17","v":0},{"$f":"'PENNANT TEAMS'!$C$31","v":0},{"$f":"'PENNANT TEAMS'!$C$45","v":0},{"$f":"'PENNANT TEAMS'!$C$59","v":0}]
[{"$f":"'PENNANT TEAMS'!$D$17","v":0},{"$f":"'PENNANT TEAMS'!$D$31","v":0},{"$f":"'PENNANT TEAMS'!$D$45","v":0},{"$f":"'PENNANT TEAMS'!$D$59","v":0}]
[{"$f":"'PENNANT TEAMS'!$E$17","v":0},{"$f":"'PENNANT TEAMS'!$E$31","v":0},{"$f":"'PENNANT TEAMS'!$E$45","v":0},{"$f":"'PENNANT TEAMS'!$E$59","v":0}]
[]
[]
[]
[{"$f":"'PENNANT TEAMS'!$A$64","v":9}]
[{"$f":"'PENNANT TEAMS'!$B$64","v":0},{"$f":"'PENNANT TEAMS'!$B$66","v":0}]
[{"$f":"'PENNANT TEAMS'!$C$64","v":0},{"$f":"'PENNANT TEAMS'!$C$66","v":0}]
[{"$f":"'PENNANT TEAMS'!$D$64","v":0},{"$f":"'PENNANT TEAMS'!$D$66","v":0}]
[{"$f":"'PENNANT TEAMS'!$E$64","v":0},{"$f":"'PENNANT TEAMS'!$E$66","v":0}]

{"sheet":"Result Stickers","index":6,"n_rows":54,"n_cols":5,"rows_kept":54,"hidden":true}
["Grade",{"$f":"'PENNANT TEAMS'!$A$8","v":1},null,"Grade",{"$f":"'PENNANT TEAMS'!$A$29","v":3.2}]
[{"$f":"'PENNANT TEAMS'!$B$8","v":0},{"$f":"'PENNANT TEAMS'!$B$9","v":""},null,{"$f":"'PENNANT TEAMS'!$B$29","v":0},{"$f":"'PENNANT TEAMS'!$B$30","v":""}]
[{"$f":"'PENNANT TEAMS'!$C$8","v":0},{"$f":"'PENNANT TEAMS'!$C$9","v":""},null,{"$f":"'PENNANT TEAMS'!$C$29","v":0},{"$f":"'PENNANT TEAMS'!$C$30","v":""}]
[{"$f":"'PENNANT TEAMS'!$D$8","v":0},{"$f":"'PENNANT TEAMS'!$D$9","v":""},null,{"$f":"'PENNANT TEAMS'!$D$29","v":0},{"$f":"'PENNANT TEAMS'!$D$30","v":""}]
[{"$f":"'PENNANT TEAMS'!$E$8","v":0},{"$f":"'PENNANT TEAMS'!$E$9","v":""},null,{"$f":"'PENNANT TEAMS'!$E$29","v":0},{"$f":"'PENNANT TEAMS'!$E$30","v":""}]
[{"$f":"'PENNANT TEAMS'!$B$10","v":0},{"$f":"'PENNANT TEAMS'!$B$11","v":""},null,{"$f":"'PENNANT TEAMS'!$B$31","v":0},{"$f":"'PENNANT TEAMS'!$B$32","v":""}]
[{"$f":"'PENNANT TEAMS'!$C$10","v":0},{"$f":"'PENNANT TEAMS'!$C$11","v":""},null,{"$f":"'PENNANT TEAMS'!$C$31","v":0},{"$f":"'PENNANT TEAMS'!$C$32","v":""}]
[{"$f":"'PENNANT TEAMS'!$D$10","v":0},{"$f":"'PENNANT TEAMS'!$D$11","v":""},null,{"$f":"'PENNANT TEAMS'!$D$31","v":0},{"$f":"'PENNANT TEAMS'!$D$32","v":""}]
[{"$f":"'PENNANT TEAMS'!$E$10","v":0},{"$f":"'PENNANT TEAMS'!$E$11","v":""},null,{"$f":"'PENNANT TEAMS'!$E$31","v":0},{"$f":"'PENNANT TEAMS'!$E$32","v":""}]
["Grade",{"$f":"'PENNANT TEAMS'!$A$15","v":2},null,"Grade",{"$f":"'PENNANT TEAMS'!$A$36","v":4.1}]
[{"$f":"'PENNANT TEAMS'!$B$15","v":0},{"$f":"'PENNANT TEAMS'!$B$16","v":""},null,{"$f":"'PENNANT TEAMS'!$B$36","v":0},{"$f":"'PENNANT TEAMS'!$B$37","v":""}]
[{"$f":"'PENNANT TEAMS'!$C$15","v":0},{"$f":"'PENNANT TEAMS'!$C$16","v":""},null,{"$f":"'PENNANT TEAMS'!$C$36","v":0},{"$f":"'PENNANT TEAMS'!$C$37","v":""}]
[{"$f":"'PENNANT TEAMS'!$D$15","v":0},{"$f":"'PENNANT TEAMS'!$D$16","v":""},null,{"$f":"'PENNANT TEAMS'!$D$36","v":0},{"$f":"'PENNANT TEAMS'!$D$37","v":""}]
[{"$f":"'PENNANT TEAMS'!$E$15","v":0},{"$f":"'PENNANT TEAMS'!$E$16","v":""},null,{"$f":"'PENNANT TEAMS'!$E$36","v":0},{"$f":"'PENNANT TEAMS'!$E$37","v":""}]
[{"$f":"'PENNANT TEAMS'!$B$17","v":0},{"$f":"'PENNANT TEAMS'!$B$18","v":""},null,{"$f":"'PENNANT TEAMS'!$B$38","v":0},{"$f":"'PENNANT TEAMS'!$B$39","v":""}]
[{"$f":"'PENNANT TEAMS'!$C$17","v":0},{"$f":"'PENNANT TEAMS'!$C$18","v":""},null,{"$f":"'PENNANT TEAMS'!$C$38","v":0},{"$f":"'PENNANT TEAMS'!$C$39","v":""}]
[{"$f":"'PENNANT TEAMS'!$D$17","v":0},{"$f":"'PENNANT TEAMS'!$D$18","v":""},null,{"$f":"'PENNANT TEAMS'!$D$38","v":0},{"$f":"'PENNANT TEAMS'!$D$39","v":""}]
[{"$f":"'PENNANT TEAMS'!$E$17","v":0},{"$f":"'PENNANT TEAMS'!$E$18","v":""},null,{"$f":"'PENNANT TEAMS'!$E$38","v":0},{"$f":"'PENNANT TEAMS'!$E$39","v":""}]
["Grade",{"$f":"'PENNANT TEAMS'!$A$22","v":3.1},null,"Grade",{"$f":"'PENNANT TEAMS'!$A$43","v":4.2}]
[{"$f":"'PENNANT TEAMS'!$B$22","v":0},{"$f":"'PENNANT TEAMS'!$B$23","v":""},null,{"$f":"'PENNANT TEAMS'!$B$43","v":0},{"$f":"'PENNANT TEAMS'!$B$44","v":""}]
[{"$f":"'PENNANT TEAMS'!$C$22","v":0},{"$f":"'PENNANT TEAMS'!$C$23","v":""},null,{"$f":"'PENNANT TEAMS'!$C$43","v":0},{"$f":"'PENNANT TEAMS'!$C$44","v":""}]
[{"$f":"'PENNANT TEAMS'!$D$22","v":0},{"$f":"'PENNANT TEAMS'!$D$23","v":""},null,{"$f":"'PENNANT TEAMS'!$D$43","v":0},{"$f":"'PENNANT TEAMS'!$D$44","v":""}]
[{"$f":"'PENNANT TEAMS'!$E$22","v":0},{"$f":"'PENNANT TEAMS'!$E$23","v":""},null,{"$f":"'PENNANT TEAMS'!$E$43","v":0},{"$f":"'PENNANT TEAMS'!$E$44","v":""}]
[{"$f":"'PENNANT TEAMS'!$B$24","v":0},{"$f":"'PENNANT TEAMS'!$B$25","v":""},null,{"$f":"'PENNANT TEAMS'!$B$45","v":0},{"$f":"'PENNANT TEAMS'!$B$46","v":""}]
[{"$f":"'PENNANT TEAMS'!$C$24","v":0},{"$f":"'PENNANT TEAMS'!$C$25","v":""},null,{"$f":"'PENNANT TEAMS'!$C$45","v":0},{"$f":"'PENNANT TEAMS'!$C$46","v":""}]
[{"$f":"'PENNANT TEAMS'!$D$24","v":0},{"$f":"'PENNANT TEAMS'!$D$25","v":""},null,{"$f":"'PENNANT TEAMS'!$D$45","v":0},{"$f":"'PENNANT TEAMS'!$D$46","v":""}]
[{"$f":"'PENNANT TEAMS'!$E$24","v":0},{"$f":"'PENNANT TEAMS'!$E$25","v":""},null,{"$f":"'PENNANT TEAMS'!$E$45","v":0},{"$f":"'PENNANT TEAMS'!$E$46","v":""}]
["Grade",{"$f":"'PENNANT TEAMS'!$A$50","v":7}]
[{"$f":"'PENNANT TEAMS'!$B$50","v":0},{"$f":"'PENNANT TEAMS'!$B$51","v":""}]
[{"$f":"'PENNANT TEAMS'!$C$50","v":0},{"$f":"'PENNANT TEAMS'!$C$51","v":""}]
[{"$f":"'PENNANT TEAMS'!$D$50","v":0},{"$f":"'PENNANT TEAMS'!$D$51","v":""}]
[{"$f":"'PENNANT TEAMS'!$E$50","v":0},{"$f":"'PENNANT TEAMS'!$E$51","v":""}]
[{"$f":"'PENNANT TEAMS'!$B$52","v":0},{"$f":"'PENNANT TEAMS'!$B$53","v":""}]
[{"$f":"'PENNANT TEAMS'!$C$52","v":0},{"$f":"'PENNANT TEAMS'!$C$53","v":""}]
[{"$f":"'PENNANT TEAMS'!$D$52","v":0},{"$f":"'PENNANT TEAMS'!$D$53","v":""}]
[{"$f":"'PENNANT TEAMS'!$E$52","v":0},{"$f":"'PENNANT TEAMS'!$E$53","v":""}]
["Grade",{"$f":"'PENNANT TEAMS'!$A$57","v":8}]
[{"$f":"'PENNANT TEAMS'!$B$57","v":0},{"$f":"'PENNANT TEAMS'!$B$58","v":""}]
[{"$f":"'PENNANT TEAMS'!$C$57","v":0},{"$f":"'PENNANT TEAMS'!$C$58","v":""}]
[{"$f":"'PENNANT TEAMS'!$D$57","v":0},{"$f":"'PENNANT TEAMS'!$D$58","v":""}]
[{"$f":"'PENNANT TEAMS'!$E$57","v":0},{"$f":"'PENNANT TEAMS'!$E$58","v":""}]
[{"$f":"'PENNANT TEAMS'!$B$59","v":0},{"$f":"'PENNANT TEAMS'!$B$60","v":""}]
[{"$f":"'PENNANT TEAMS'!$C$59","v":0},{"$f":"'PENNANT TEAMS'!$C$60","v":""}]
[{"$f":"'PENNANT TEAMS'!$D$59","v":0},{"$f":"'PENNANT TEAMS'!$D$60","v":""}]
[{"$f":"'PENNANT TEAMS'!$E$59","v":0},{"$f":"'PENNANT TEAMS'!$E$60","v":""}]
["Grade",{"$f":"'PENNANT TEAMS'!$A$64","v":9}]
[{"$f":"'PENNANT TEAMS'!$B$64","v":0},{"$f":"'PENNANT TEAMS'!$B$65","v":""}]
[{"$f":"'PENNANT TEAMS'!$C$64","v":0},{"$f":"'PENNANT TEAMS'!$C$65","v":""}]
[{"$f":"'PENNANT TEAMS'!$D$64","v":0},{"$f":"'PENNANT TEAMS'!$D$65","v":""}]
[{"$f":"'PENNANT TEAMS'!$E$64","v":0},{"$f":"'PENNANT TEAMS'!$E$65","v":""}]
[{"$f":"'PENNANT TEAMS'!$B$66","v":0},{"$f":"'PENNANT TEAMS'!$B$67","v":""}]
[{"$f":"'PENNANT TEAMS'!$C$66","v":0},{"$f":"'PENNANT TEAMS'!$C$67","v":""}]
[{"$f":"'PENNANT TEAMS'!$D$66","v":0},{"$f":"'PENNANT TEAMS'!$D$67","v":""}]
[{"$f":"'PENNANT TEAMS'!$E$66","v":0},{"$f":"'PENNANT TEAMS'!$E$67","v":""}]

{"sheet":"Player List","index":7,"n_rows":73,"n_cols":8,"rows_kept":73,"merged":[[0,5,0,7]]}
["Number","NAME","GRADE",null,null,"SIDE Captian"]
[{"$f":"'PENNANT TEAMS'!$B$9","v":""},{"$f":"'PENNANT TEAMS'!$B$8","v":0},{"$f":"'PENNANT TEAMS'!$A$8","v":1},{"$nulls":3},"Name","Grade"]
[{"$f":"'PENNANT TEAMS'!$C$9","v":""},{"$f":"'PENNANT TEAMS'!$C$8","v":0},{"$f":"'PENNANT TEAMS'!$A$8","v":1},{"$nulls":3},{"$f":"'PENNANT TEAMS'!#REF!","v":{"$error":"#REF!"}},{"$f":"'PENNANT TEAMS'!$A$8","v":1}]
[{"$f":"'PENNANT TEAMS'!$D$9","v":""},{"$f":"'PENNANT TEAMS'!$D$8","v":0},{"$f":"'PENNANT TEAMS'!$A$8","v":1},{"$nulls":3},{"$f":"'PENNANT TEAMS'!#REF!","v":{"$error":"#REF!"}},{"$f":"'PENNANT TEAMS'!$A$15","v":2}]
[{"$f":"'PENNANT TEAMS'!$E$9","v":""},{"$f":"'PENNANT TEAMS'!$E$8","v":0},{"$f":"'PENNANT TEAMS'!$A$8","v":1},{"$nulls":3},{"$f":"'PENNANT TEAMS'!#REF!","v":{"$error":"#REF!"}},{"$f":"'PENNANT TEAMS'!$A$22","v":3.1}]
[{"$f":"'PENNANT TEAMS'!$B$11","v":""},{"$f":"'PENNANT TEAMS'!$B$10","v":0},{"$f":"'PENNANT TEAMS'!$A$8","v":1},{"$nulls":3},{"$f":"'PENNANT TEAMS'!#REF!","v":{"$error":"#REF!"}},{"$f":"'PENNANT TEAMS'!$A$29","v":3.2}]
[{"$f":"'PENNANT TEAMS'!$C$11","v":""},{"$f":"'PENNANT TEAMS'!$C$10","v":0},{"$f":"'PENNANT TEAMS'!$A$8","v":1},{"$nulls":3},{"$f":"'PENNANT TEAMS'!#REF!","v":{"$error":"#REF!"}},{"$f":"'PENNANT TEAMS'!$A$36","v":4.1}]
[{"$f":"'PENNANT TEAMS'!$D$11","v":""},{"$f":"'PENNANT TEAMS'!$D$10","v":0},{"$f":"'PENNANT TEAMS'!$A$8","v":1},{"$nulls":3},{"$f":"'PENNANT TEAMS'!#REF!","v":{"$error":"#REF!"}},{"$f":"'PENNANT TEAMS'!$A$43","v":4.2}]
[{"$f":"'PENNANT TEAMS'!$E$11","v":""},{"$f":"'PENNANT TEAMS'!$E$10","v":0},{"$f":"'PENNANT TEAMS'!$A$8","v":1},{"$nulls":3},{"$f":"'PENNANT TEAMS'!$A$52","v":"Name"},{"$f":"'PENNANT TEAMS'!$A$50","v":7}]
[{"$f":"'PENNANT TEAMS'!$B$16","v":""},{"$f":"'PENNANT TEAMS'!$B$15","v":0},{"$f":"'PENNANT TEAMS'!$A$15","v":2},{"$nulls":3},{"$f":"'PENNANT TEAMS'!$A$59","v":"Name"},{"$f":"'PENNANT TEAMS'!$A$57","v":8}]
[{"$f":"'PENNANT TEAMS'!$C$16","v":""},{"$f":"'PENNANT TEAMS'!$C$15","v":0},{"$f":"'PENNANT TEAMS'!$A$15","v":2},{"$nulls":3},{"$f":"'PENNANT TEAMS'!$A$66","v":"Name"},{"$f":"'PENNANT TEAMS'!$A$64","v":9}]
[{"$f":"'PENNANT TEAMS'!$D$16","v":""},{"$f":"'PENNANT TEAMS'!$D$15","v":0},{"$f":"'PENNANT TEAMS'!$A$15","v":2}]
[{"$f":"'PENNANT TEAMS'!$E$16","v":""},{"$f":"'PENNANT TEAMS'!$E$15","v":0},{"$f":"'PENNANT TEAMS'!$A$15","v":2}]
[{"$f":"'PENNANT TEAMS'!$B$18","v":""},{"$f":"'PENNANT TEAMS'!$B$17","v":0},{"$f":"'PENNANT TEAMS'!$A$15","v":2}]
[{"$f":"'PENNANT TEAMS'!$C$18","v":""},{"$f":"'PENNANT TEAMS'!$C$17","v":0},{"$f":"'PENNANT TEAMS'!$A$15","v":2}]
[{"$f":"'PENNANT TEAMS'!$D$18","v":""},{"$f":"'PENNANT TEAMS'!$D$17","v":0},{"$f":"'PENNANT TEAMS'!$A$15","v":2}]
[{"$f":"'PENNANT TEAMS'!$E$18","v":""},{"$f":"'PENNANT TEAMS'!$E$17","v":0},{"$f":"'PENNANT TEAMS'!$A$15","v":2}]
[{"$f":"'PENNANT TEAMS'!$B$23","v":""},{"$f":"'PENNANT TEAMS'!$B$22","v":0},{"$f":"'PENNANT TEAMS'!$A$22","v":3.1}]
[{"$f":"'PENNANT TEAMS'!$C$23","v":""},{"$f":"'PENNANT TEAMS'!$C$22","v":0},{"$f":"'PENNANT TEAMS'!$A$22","v":3.1}]
[{"$f":"'PENNANT TEAMS'!$D$23","v":""},{"$f":"'PENNANT TEAMS'!$D$22","v":0},{"$f":"'PENNANT TEAMS'!$A$22","v":3.1}]
[{"$f":"'PENNANT TEAMS'!$E$23","v":""},{"$f":"'PENNANT TEAMS'!$E$22","v":0},{"$f":"'PENNANT TEAMS'!$A$22","v":3.1}]
[{"$f":"'PENNANT TEAMS'!$B$25","v":""},{"$f":"'PENNANT TEAMS'!$B$24","v":0},{"$f":"'PENNANT TEAMS'!$A$22","v":3.1}]
[{"$f":"'PENNANT TEAMS'!$C$25","v":""},{"$f":"'PENNANT TEAMS'!$C$24","v":0},{"$f":"'PENNANT TEAMS'!$A$22","v":3.1}]
[{"$f":"'PENNANT TEAMS'!$D$25","v":""},{"$f":"'PENNANT TEAMS'!$D$24","v":0},{"$f":"'PENNANT TEAMS'!$A$22","v":3.1}]
[{"$f":"'PENNANT TEAMS'!$E$25","v":""},{"$f":"'PENNANT TEAMS'!$E$24","v":0},{"$f":"'PENNANT TEAMS'!$A$22","v":3.1}]
[{"$f":"'PENNANT TEAMS'!$B$30","v":""},{"$f":"'PENNANT TEAMS'!$B$29","v":0},{"$f":"'PENNANT TEAMS'!$A$29","v":3.2}]
[{"$f":"'PENNANT TEAMS'!$C$30","v":""},{"$f":"'PENNANT TEAMS'!$C$29","v":0},{"$f":"'PENNANT TEAMS'!$A$29","v":3.2}]
[{"$f":"'PENNANT TEAMS'!$D$30","v":""},{"$f":"'PENNANT TEAMS'!$D$29","v":0},{"$f":"'PENNANT TEAMS'!$A$29","v":3.2}]
[{"$f":"'PENNANT TEAMS'!$E$30","v":""},{"$f":"'PENNANT TEAMS'!$E$29","v":0},{"$f":"'PENNANT TEAMS'!$A$29","v":3.2}]
[{"$f":"'PENNANT TEAMS'!$B$32","v":""},{"$f":"'PENNANT TEAMS'!$B$31","v":0},{"$f":"'PENNANT TEAMS'!$A$29","v":3.2}]
[{"$f":"'PENNANT TEAMS'!$C$32","v":""},{"$f":"'PENNANT TEAMS'!$C$31","v":0},{"$f":"'PENNANT TEAMS'!$A$29","v":3.2}]
[{"$f":"'PENNANT TEAMS'!$D$32","v":""},{"$f":"'PENNANT TEAMS'!$D$31","v":0},{"$f":"'PENNANT TEAMS'!$A$29","v":3.2}]
[{"$f":"'PENNANT TEAMS'!$E$32","v":""},{"$f":"'PENNANT TEAMS'!$E$31","v":0},{"$f":"'PENNANT TEAMS'!$A$29","v":3.2}]
[{"$f":"'PENNANT TEAMS'!$B$37","v":""},{"$f":"'PENNANT TEAMS'!$B$36","v":0},{"$f":"'PENNANT TEAMS'!$A$36","v":4.1}]
[{"$f":"'PENNANT TEAMS'!$C$37","v":""},{"$f":"'PENNANT TEAMS'!$C$36","v":0},{"$f":"'PENNANT TEAMS'!$A$36","v":4.1}]
[{"$f":"'PENNANT TEAMS'!$D$37","v":""},{"$f":"'PENNANT TEAMS'!$D$36","v":0},{"$f":"'PENNANT TEAMS'!$A$36","v":4.1}]
[{"$f":"'PENNANT TEAMS'!$E$37","v":""},{"$f":"'PENNANT TEAMS'!$E$36","v":0},{"$f":"'PENNANT TEAMS'!$A$36","v":4.1}]
[{"$f":"'PENNANT TEAMS'!$B$39","v":""},{"$f":"'PENNANT TEAMS'!$B$38","v":0},{"$f":"'PENNANT TEAMS'!$A$36","v":4.1}]
[{"$f":"'PENNANT TEAMS'!$C$39","v":""},{"$f":"'PENNANT TEAMS'!$C$38","v":0},{"$f":"'PENNANT TEAMS'!$A$36","v":4.1}]
[{"$f":"'PENNANT TEAMS'!$D$39","v":""},{"$f":"'PENNANT TEAMS'!$D$38","v":0},{"$f":"'PENNANT TEAMS'!$A$36","v":4.1}]
[{"$f":"'PENNANT TEAMS'!$E$39","v":""},{"$f":"'PENNANT TEAMS'!$E$38","v":0},{"$f":"'PENNANT TEAMS'!$A$36","v":4.1}]
[{"$f":"'PENNANT TEAMS'!$B$44","v":""},{"$f":"'PENNANT TEAMS'!$B$43","v":0},{"$f":"'PENNANT TEAMS'!$A$43","v":4.2}]
[{"$f":"'PENNANT TEAMS'!$C$44","v":""},{"$f":"'PENNANT TEAMS'!$C$43","v":0},{"$f":"'PENNANT TEAMS'!$A$43","v":4.2}]
[{"$f":"'PENNANT TEAMS'!$D$44","v":""},{"$f":"'PENNANT TEAMS'!$D$43","v":0},{"$f":"'PENNANT TEAMS'!$A$43","v":4.2}]
[{"$f":"'PENNANT TEAMS'!$E$44","v":""},{"$f":"'PENNANT TEAMS'!$E$43","v":0},{"$f":"'PENNANT TEAMS'!$A$43","v":4.2}]
[{"$f":"'PENNANT TEAMS'!$B$46","v":""},{"$f":"'PENNANT TEAMS'!$B$45","v":0},{"$f":"'PENNANT TEAMS'!$A$43","v":4.2}]
[{"$f":"'PENNANT TEAMS'!$C$46","v":""},{"$f":"'PENNANT TEAMS'!$C$45","v":0},{"$f":"'PENNANT TEAMS'!$A$43","v":4.2}]
[{"$f":"'PENNANT TEAMS'!$D$46","v":""},{"$f":"'PENNANT TEAMS'!$D$45","v":0},{"$f":"'PENNANT TEAMS'!$A$43","v":4.2}]
[{"$f":"'PENNANT TEAMS'!$E$46","v":""},{"$f":"'PENNANT TEAMS'!$E$45","v":0},{"$f":"'PENNANT TEAMS'!$A$43","v":4.2}]
[{"$f":"'PENNANT TEAMS'!$B$51","v":""},{"$f":"'PENNANT TEAMS'!$B$50","v":0},{"$f":"'PENNANT TEAMS'!$A$50","v":7}]
[{"$f":"'PENNANT TEAMS'!$C$51","v":""},{"$f":"'PENNANT TEAMS'!$C$50","v":0},{"$f":"'PENNANT TEAMS'!$A$50","v":7}]
[{"$f":"'PENNANT TEAMS'!$D$51","v":""},{"$f":"'PENNANT TEAMS'!$D$50","v":0},{"$f":"'PENNANT TEAMS'!$A$50","v":7}]
[{"$f":"'PENNANT TEAMS'!$E$51","v":""},{"$f":"'PENNANT TEAMS'!$E$50","v":0},{"$f":"'PENNANT TEAMS'!$A$50","v":7}]
[{"$f":"'PENNANT TEAMS'!$B$53","v":""},{"$f":"'PENNANT TEAMS'!$B$52","v":0},{"$f":"'PENNANT TEAMS'!$A$50","v":7}]
[{"$f":"'PENNANT TEAMS'!$C$53","v":""},{"$f":"'PENNANT TEAMS'!$C$52","v":0},{"$f":"'PENNANT TEAMS'!$A$50","v":7}]
[{"$f":"'PENNANT TEAMS'!$D$53","v":""},{"$f":"'PENNANT TEAMS'!$D$52","v":0},{"$f":"'PENNANT TEAMS'!$A$50","v":7}]
[{"$f":"'PENNANT TEAMS'!$E$53","v":""},{"$f":"'PENNANT TEAMS'!$E$52","v":0},{"$f":"'PENNANT TEAMS'!$A$50","v":7}]
[{"$f":"'PENNANT TEAMS'!$B$58","v":""},{"$f":"'PENNANT TEAMS'!$B$57","v":0},{"$f":"'PENNANT TEAMS'!$A$57","v":8}]
[{"$f":"'PENNANT TEAMS'!$C$58","v":""},{"$f":"'PENNANT TEAMS'!$C$57","v":0},{"$f":"'PENNANT TEAMS'!$A$57","v":8}]
[{"$f":"'PENNANT TEAMS'!$D$58","v":""},{"$f":"'PENNANT TEAMS'!$D$57","v":0},{"$f":"'PENNANT TEAMS'!$A$57","v":8}]
[{"$f":"'PENNANT TEAMS'!$E$58","v":""},{"$f":"'PENNANT TEAMS'!$E$57","v":0},{"$f":"'PENNANT TEAMS'!$A$57","v":8}]
[{"$f":"'PENNANT TEAMS'!$B$60","v":""},{"$f":"'PENNANT TEAMS'!$B$59","v":0},{"$f":"'PENNANT TEAMS'!$A$57","v":8}]
[{"$f":"'PENNANT TEAMS'!$C$60","v":""},{"$f":"'PENNANT TEAMS'!$C$59","v":0},{"$f":"'PENNANT TEAMS'!$A$57","v":8}]
[{"$f":"'PENNANT TEAMS'!$D$60","v":""},{"$f":"'PENNANT TEAMS'!$D$59","v":0},{"$f":"'PENNANT TEAMS'!$A$57","v":8}]
[{"$f":"'PENNANT TEAMS'!$E$60","v":""},{"$f":"'PENNANT TEAMS'!$E$59","v":0},{"$f":"'PENNANT TEAMS'!$A$57","v":8}]
[{"$f":"'PENNANT TEAMS'!$B$65","v":""},{"$f":"'PENNANT TEAMS'!$B$64","v":0},{"$f":"'PENNANT TEAMS'!$A$64","v":9}]
[{"$f":"'PENNANT TEAMS'!$C$65","v":""},{"$f":"'PENNANT TEAMS'!$C$64","v":0},{"$f":"'PENNANT TEAMS'!$A$64","v":9}]
[{"$f":"'PENNANT TEAMS'!$D$65","v":""},{"$f":"'PENNANT TEAMS'!$D$64","v":0},{"$f":"'PENNANT TEAMS'!$A$64","v":9}]
[{"$f":"'PENNANT TEAMS'!$E$65","v":""},{"$f":"'PENNANT TEAMS'!$E$64","v":0},{"$f":"'PENNANT TEAMS'!$A$64","v":9}]
[{"$f":"'PENNANT TEAMS'!$B$67","v":""},{"$f":"'PENNANT TEAMS'!$B$66","v":0},{"$f":"'PENNANT TEAMS'!$A$64","v":9}]
[{"$f":"'PENNANT TEAMS'!$C$67","v":""},{"$f":"'PENNANT TEAMS'!$C$66","v":0},{"$f":"'PENNANT TEAMS'!$A$64","v":9}]
[{"$f":"'PENNANT TEAMS'!$D$67","v":""},{"$f":"'PENNANT TEAMS'!$D$66","v":0},{"$f":"'PENNANT TEAMS'!$A$64","v":9}]
[{"$f":"'PENNANT TEAMS'!$E$67","v":""},{"$f":"'PENNANT TEAMS'!$E$66","v":0},{"$f":"'PENNANT TEAMS'!$A$64","v":9}]

{"sheet":"Weekly Records","index":8,"n_rows":251,"n_cols":45,"rows_kept":251,"merged":[[1,18,1,19],[1,21,1,22],[1,24,1,25],[1,27,1,28],[1,30,1,31],[1,33,1,34],[1,36,1,37],[1,39,1,40],[1,42,1,43],[1,45,1,46]]}
["Number of Sides=",null,5,null,{"$f":"COUNT(E3:E249)","v":0},{"$f":"COUNT(F3:F249)","v":0},{"$f":"COUNT(G3:G249)","v":0},{"$f":"COUNT(H3:H249)","v":0},{"$f":"COUNT(I3:I249)","v":0},null,null,{"$f":"COUNT(L3:L249)","v":0},{"$f":"COUNT(M3:M249)","v":0},{"$f":"COUNT(N3:N249)","v":0},{"$f":"COUNT(O3:O249)","v":0},{"$f":"COUNT(P3:P249)","v":0}]
["Name",null,"RNSWBA Registration","2015 Grade","Rnd1","Rnd2","Rnd3","Rnd4","Rnd5",null,"2015 Grade","Rnd6","Rnd7","Rnd8","Rnd9","Rnd10",null,"round1",null,null,"round2",null,null,"round3",null,null,"round4",null,null,"round5",null,null,"round6",null,null,"round7",null,null,"round8",null,null,"round9",null,null,"round10"]
[{"$nulls":4},{"$f":"IF(ISNA(VLOOKUP(C3,round1,3,FALSE)),\"\",VLOOKUP(C3,round1,3,FALSE))","v":""},{"$f":"IF(ISNA(VLOOKUP(C3,round2,3,FALSE)),\"\",VLOOKUP(C3,round2,3,FALSE))","v":""},{"$f":"IF(ISNA(VLOOKUP(C3,round3,3,FALSE)),\"\",VLOOKUP(C3,round3,3,FALSE))","v":""},{"$f":"IF(ISNA(VLOOKUP(C3,round4,3,FALSE)),\"\",VLOOKUP(C3,round4,3,FALSE))","v":""},{"$f":"IF(ISNA(VLOOKUP(C3,round5,3,FALSE)),\"\",VLOOKUP(C3,round5,3,FALSE))","v":""},{"$f":"MAX(E3:I3)","v":0},null,{"$f":"IF(ISNA(VLOOKUP(C3,round6,3,FALSE)),\"\",VLOOKUP(C3,round6,3,FALSE))","v":""},{"$f":"IF(ISNA(VLOOKUP(C3,round7,3,FALSE)),\"\",VLOOKUP(C3,round7,3,FALSE))","v":""},{"$f":"IF(ISNA(VLOOKUP(C3,round8,3,FALSE)),\"\",VLOOKUP(C3,round8,3,FALSE))","v":""},{"$f":"IF(ISNA(VLOOKUP(C3,round9,3,FALSE)),\"\",VLOOKUP(C3,round9,3,FALSE))","v":""},{"$f":"IF(ISNA(VLOOKUP(C3,round10,3,FALSE)),\"\",VLOOKUP(C3,round10,3,FALSE))","v":""},{"$f":"MAX(L3:P3)","v":0}]
[{"$nulls":4},"","","","","",0,null,"","","","","",{"$f":"MAX(L4:P4)","v":0}]
[{"$nulls":4},"","","","","",0,null,"","","","","",0]
[{"$nulls":4},"","","","","",0,null,"","","","","",0]
[{"$nulls":4},"","","","","",0,null,"","","","","",0]
[{"$nulls":4},"","","","","",0,null,"","","","","",0]
[{"$nulls":4},"","","","","",0,null,"","","","","",0]
[{"$nulls":4},"","","","","",0,null,"","","","","",0]
[{"$nulls":4},"","","","","",0,null,"","","","","",0]
[{"$nulls":4},"","","","","",0,null,"","","","","",0]
[{"$nulls":4},"","","","","",0,null,"","","","","",0]
[{"$nulls":4},"","","","","",0,null,"","","","","",0]
[{"$nulls":4},"","","","","",0,null,"","","","","",0]
[{"$nulls":4},"","","","","",0,null,"","","","","",0]
[{"$nulls":4},"","","","","",0,null,"","","","","",0]
[{"$nulls":4},"","","","","",0,null,"","","","","",0]
[{"$nulls":4},"","","","","",0,null,"","","","","",0]
[{"$nulls":4},"","","","","",0,null,"","","","","",0]
[{"$nulls":4},"","","","","",0,null,"","","","","",0]
[{"$nulls":4},"","","","","",0,null,"","","","","",0]
[{"$nulls":4},"","","","","",0,null,"","","","","",0]
[{"$nulls":4},"","","","","",0,null,"","","","","",0]
[{"$nulls":4},"","","","","",0,null,"","","","","",0]
[{"$nulls":4},"","","","","",0,null,"","","","","",0]
[{"$nulls":4},"","","","","",0,null,"","","","","",0]
[{"$nulls":4},"","","","","",0,null,"","","","","",0]
[{"$nulls":4},"","","","","",0,null,"","","","","",0]
[{"$nulls":4},"","","","","",0,null,"","","","","",0]
[{"$nulls":4},"","","","","",0,null,"","","","","",0]
[{"$nulls":4},"","","","","",0,null,"","","","","",0]
[{"$nulls":4},"","","","","",0,null,"","","","","",0]
[{"$nulls":4},"","","","","",0,null,"","","","","",0]
[{"$nulls":4},{"$f":"IF(ISNA(VLOOKUP(C35,round1,3,FALSE)),\"\",VLOOKUP(C35,round1,3,FALSE))","v":""},{"$f":"IF(ISNA(VLOOKUP(C35,round2,3,FALSE)),\"\",VLOOKUP(C35,round2,3,FALSE))","v":""},{"$f":"IF(ISNA(VLOOKUP(C35,round3,3,FALSE)),\"\",VLOOKUP(C35,round3,3,FALSE))","v":""},{"$f":"IF(ISNA(VLOOKUP(C35,round4,3,FALSE)),\"\",VLOOKUP(C35,round4,3,FALSE))","v":""},{"$f":"IF(ISNA(VLOOKUP(C35,round5,3,FALSE)),\"\",VLOOKUP(C35,round5,3,FALSE))","v":""},{"$f":"MAX(E35:I35)","v":0},null,{"$f":"IF(ISNA(VLOOKUP(C35,round6,3,FALSE)),\"\",VLOOKUP(C35,round6,3,FALSE))","v":""},{"$f":"IF(ISNA(VLOOKUP(C35,round7,3,FALSE)),\"\",VLOOKUP(C35,round7,3,FALSE))","v":""},{"$f":"IF(ISNA(VLOOKUP(C35,round8,3,FALSE)),\"\",VLOOKUP(C35,round8,3,FALSE))","v":""},{"$f":"IF(ISNA(VLOOKUP(C35,round9,3,FALSE)),\"\",VLOOKUP(C35,round9,3,FALSE))","v":""},{"$f":"IF(ISNA(VLOOKUP(C35,round10,3,FALSE)),\"\",VLOOKUP(C35,round10,3,FALSE))","v":""},0]
[{"$nulls":4},"","","","","",0,null,"","","","","",0]
[{"$nulls":4},"","","","","",0,null,"","","","","",0]
[{"$nulls":4},"","","","","",0,null,"","","","","",0]
[{"$nulls":4},"","","","","",0,null,"","","","","",0]
[{"$nulls":4},"","","","","",0,null,"","","","","",0]
[{"$nulls":4},"","","","","",0,null,"","","","","",0]
[{"$nulls":4},"","","","","",0,null,"","","","","",0]
[{"$nulls":4},"","","","","",0,null,"","","","","",0]
[{"$nulls":4},"","","","","",0,null,"","","","","",0]
[{"$nulls":4},"","","","","",0,null,"","","","","",0]
[{"$nulls":4},"","","","","",0,null,"","","","","",0]
[{"$nulls":4},"","","","","",0,null,"","","","","",0]
[{"$nulls":4},"","","","","",0,null,"","","","","",0]
[{"$nulls":4},"","","","","",0,null,"","","","","",0]
[{"$nulls":4},"","","","","",0,null,"","","","","",0]
[{"$nulls":4},"","","","","",0,null,"","","","","",0]
[{"$nulls":4},"","","","","",0,null,"","","","","",0]
[{"$nulls":4},"","","","","",0,null,"","","","","",0]
[{"$nulls":4},"","","","","",0,null,"","","","","",0]
[{"$nulls":4},"","","","","",0,null,"","","","","",0]
[{"$nulls":4},"","","","","",0,null,"","","","","",0]
[{"$nulls":4},"","","","","",0,null,"","","","","",0]
[{"$nulls":4},"","","","","",0,null,"","","","","",0]
[{"$nulls":4},"","","","","",0,null,"","","","","",0]
[{"$nulls":4},"","","","","",0,null,"","","","","",0]
[{"$nulls":4},"","","","","",0,null,"","","","","",0]
[{"$nulls":4},"","","","","",0,null,"","","","","",0]
[{"$nulls":4},"","","","","",0,null,"","","","","",0]
[{"$nulls":4},"","","","","",0,null,"","","","","",0]
[{"$nulls":4},"","","","","",0,null,"","","","","",0]
[{"$nulls":4},"","","","","",0,null,"","","","","",0]
[{"$nulls":4},{"$f":"IF(ISNA(VLOOKUP(C67,round1,3,FALSE)),\"\",VLOOKUP(C67,round1,3,FALSE))","v":""},{"$f":"IF(ISNA(VLOOKUP(C67,round2,3,FALSE)),\"\",VLOOKUP(C67,round2,3,FALSE))","v":""},{"$f":"IF(ISNA(VLOOKUP(C67,round3,3,FALSE)),\"\",VLOOKUP(C67,round3,3,FALSE))","v":""},{"$f":"IF(ISNA(VLOOKUP(C67,round4,3,FALSE)),\"\",VLOOKUP(C67,round4,3,FALSE))","v":""},{"$f":"IF(ISNA(VLOOKUP(C67,round5,3,FALSE)),\"\",VLOOKUP(C67,round5,3,FALSE))","v":""},{"$f":"MAX(E67:I67)","v":0},null,{"$f":"IF(ISNA(VLOOKUP(C67,round6,3,FALSE)),\"\",VLOOKUP(C67,round6,3,FALSE))","v":""},{"$f":"IF(ISNA(VLOOKUP(C67,round7,3,FALSE)),\"\",VLOOKUP(C67,round7,3,FALSE))","v":""},{"$f":"IF(ISNA(VLOOKUP(C67,round8,3,FALSE)),\"\",VLOOKUP(C67,round8,3,FALSE))","v":""},{"$f":"IF(ISNA(VLOOKUP(C67,round9,3,FALSE)),\"\",VLOOKUP(C67,round9,3,FALSE))","v":""},{"$f":"IF(ISNA(VLOOKUP(C67,round10,3,FALSE)),\"\",VLOOKUP(C67,round10,3,FALSE))","v":""},0]
[{"$nulls":4},"","","","","",0,null,"","","","","",{"$f":"MAX(L68:P68)","v":0}]
[{"$nulls":4},"","","","","",0,null,"","","","","",0]
[{"$nulls":4},"","","","","",0,null,"","","","","",0]
[{"$nulls":4},"","","","","",0,null,"","","","","",0]
[{"$nulls":4},"","","","","",0,null,"","","","","",0]
[{"$nulls":4},"","","","","",0,null,"","","","","",0]
[{"$nulls":4},"","","","","",0,null,"","","","","",0]
[{"$nulls":4},"","","","","",0,null,"","","","","",0]
[{"$nulls":4},"","","","","",0,null,"","","","","",0]
[{"$nulls":4},"","","","","",0,null,"","","","","",0]
[{"$nulls":4},"","","","","",0,null,"","","","","",0]
[{"$nulls":4},"","","","","",0,null,"","","","","",0]
[{"$nulls":4},"","","","","",0,null,"","","","","",0]
[{"$nulls":4},"","","","","",0,null,"","","","","",0]
[{"$nulls":4},"","","","","",0,null,"","","","","",0]
[{"$nulls":4},"","","","","",0,null,"","","","","",0]
[{"$nulls":4},"","","","","",0,null,"","","","","",0]
[{"$nulls":4},"","","","","",0,null,"","","","","",0]
[{"$nulls":4},"","","","","",0,null,"","","","","",0]
[{"$nulls":4},"","","","","",0,null,"","","","","",0]
[{"$nulls":4},"","","","","",0,null,"","","","","",0]
[{"$nulls":4},"","","","","",0,null,"","","","","",0]
[{"$nulls":4},"","","","","",0,null,"","","","","",0]
[{"$nulls":4},"","","","","",0,null,"","","","","",0]
[{"$nulls":4},"","","","","",0,null,"","","","","",0]
[{"$nulls":4},"","","","","",0,null,"","","","","",0]
[" ",null," ",null,"","","","","",0,null,"","","","","",0]
[" ",null," ",null,"","","","","",0,null,"","","","","",0]
[{"$nulls":4},"","","","","",0,null,"","","","","",0]
[{"$nulls":4},"","","","","",0,null,"","","","","",0]
[{"$nulls":4},"","","","","",0,null,"","","","","",0]
[{"$nulls":4},{"$f":"IF(ISNA(VLOOKUP(C99,round1,3,FALSE)),\"\",VLOOKUP(C99,round1,3,FALSE))","v":""},{"$f":"IF(ISNA(VLOOKUP(C99,round2,3,FALSE)),\"\",VLOOKUP(C99,round2,3,FALSE))","v":""},{"$f":"IF(ISNA(VLOOKUP(C99,round3,3,FALSE)),\"\",VLOOKUP(C99,round3,3,FALSE))","v":""},{"$f":"IF(ISNA(VLOOKUP(C99,round4,3,FALSE)),\"\",VLOOKUP(C99,round4,3,FALSE))","v":""},{"$f":"IF(ISNA(VLOOKUP(C99,round5,3,FALSE)),\"\",VLOOKUP(C99,round5,3,FALSE))","v":""},{"$f":"MAX(E99:I99)","v":0},null,{"$f":"IF(ISNA(VLOOKUP(C99,round6,3,FALSE)),\"\",VLOOKUP(C99,round6,3,FALSE))","v":""},{"$f":"IF(ISNA(VLOOKUP(C99,round7,3,FALSE)),\"\",VLOOKUP(C99,round7,3,FALSE))","v":""},{"$f":"IF(ISNA(VLOOKUP(C99,round8,3,FALSE)),\"\",VLOOKUP(C99,round8,3,FALSE))","v":""},{"$f":"IF(ISNA(VLOOKUP(C99,round9,3,FALSE)),\"\",VLOOKUP(C99,round9,3,FALSE))","v":""},{"$f":"IF(ISNA(VLOOKUP(C99,round10,3,FALSE)),\"\",VLOOKUP(C99,round10,3,FALSE))","v":""},0]
[{"$nulls":4},"","","","","",0,null,"","","","","",0]
[{"$nulls":4},"","","","","",0,null,"","","","","",0]
[{"$nulls":4},"","","","","",0,null,"","","","","",0]
[{"$nulls":4},"","","","","",0,null,"","","","","",0]
[{"$nulls":4},"","","","","",0,null,"","","","","",0]
[{"$nulls":4},"","","","","",0,null,"","","","","",0]
[{"$nulls":4},"","","","","",0,null,"","","","","",0]
[{"$nulls":4},"","","","","",0,null,"","","","","",0]
[{"$nulls":4},"","","","","",0,null,"","","","","",0]
[{"$nulls":4},"","","","","",0,null,"","","","","",0]
[{"$nulls":4},"","","","","",0,null,"","","","","",0]
[{"$nulls":4},"","","","","",0,null,"","","","","",0]
[{"$nulls":4},"","","","","",0,null,"","","","","",0]
[{"$nulls":4},"","","","","",0,null,"","","","","",0]
[{"$nulls":4},"","","","","",0,null,"","","","","",0]
[{"$nulls":4},"","","","","",0,null,"","","","","",0]
[{"$nulls":4},"","","","","",0,null,"","","","","",0]
[{"$nulls":4},"","","","","",0,null,"","","","","",0]
[{"$nulls":4},"","","","","",0,null,"","","","","",0]
[{"$nulls":4},"","","","","",0,null,"","","","","",0]
[{"$nulls":4},"","","","","",0,null,"","","","","",0]
[{"$nulls":4},"","","","","",0,null,"","","","","",0]
[{"$nulls":4},"","","","","",0,null,"","","","","",0]
[{"$nulls":4},"","","","","",0,null,"","","","","",0]
[{"$nulls":4},"","","","","",0,null,"","","","","",0]
[{"$nulls":4},"","","","","",0,null,"","","","","",0]
[{"$nulls":4},"","","","","",0,null,"","","","","",0]
[{"$nulls":4},"","","","","",0,null,"","","","","",0]
[{"$nulls":4},"","","","","",0,null,"","","","","",0]
[{"$nulls":4},"","","","","",0,null,"","","","","",0]
[{"$nulls":4},"","","","","",0,null,"","","","","",0]
[{"$nulls":4},{"$f":"IF(ISNA(VLOOKUP(C131,round1,3,FALSE)),\"\",VLOOKUP(C131,round1,3,FALSE))","v":""},{"$f":"IF(ISNA(VLOOKUP(C131,round2,3,FALSE)),\"\",VLOOKUP(C131,round2,3,FALSE))","v":""},{"$f":"IF(ISNA(VLOOKUP(C131,round3,3,FALSE)),\"\",VLOOKUP(C131,round3,3,FALSE))","v":""},{"$f":"IF(ISNA(VLOOKUP(C131,round4,3,FALSE)),\"\",VLOOKUP(C131,round4,3,FALSE))","v":""},{"$f":"IF(ISNA(VLOOKUP(C131,round5,3,FALSE)),\"\",VLOOKUP(C131,round5,3,FALSE))","v":""},{"$f":"MAX(E131:I131)","v":0},null,{"$f":"IF(ISNA(VLOOKUP(C131,round6,3,FALSE)),\"\",VLOOKUP(C131,round6,3,FALSE))","v":""},{"$f":"IF(ISNA(VLOOKUP(C131,round7,3,FALSE)),\"\",VLOOKUP(C131,round7,3,FALSE))","v":""},{"$f":"IF(ISNA(VLOOKUP(C131,round8,3,FALSE)),\"\",VLOOKUP(C131,round8,3,FALSE))","v":""},{"$f":"IF(ISNA(VLOOKUP(C131,round9,3,FALSE)),\"\",VLOOKUP(C131,round9,3,FALSE))","v":""},{"$f":"IF(ISNA(VLOOKUP(C131,round10,3,FALSE)),\"\",VLOOKUP(C131,round10,3,FALSE))","v":""},0]
[{"$nulls":4},"","","","","",{"$f":"MAX(E132:I132)","v":0},null,"","","","","",{"$f":"MAX(L132:P132)","v":0}]
[{"$nulls":4},"","","","","",0,null,"","","","","",0]
[{"$nulls":4},"","","","","",0,null,"","","","","",0]
[{"$nulls":4},"","","","","",0,null,"","","","","",0]
[{"$nulls":4},"","","","","",0,null,"","","","","",0]
[{"$nulls":4},"","","","","",0,null,"","","","","",0]
[{"$nulls":4},"","","","","",0,null,"","","","","",0]
[{"$nulls":4},"","","","","",0,null,"","","","","",0]
[{"$nulls":4},{"$f":"IF(ISNA(VLOOKUP(C140,round1,3,FALSE)),\"\",VLOOKUP(C140,round1,3,FALSE))","v":""},"","","","",0,null,"","","","","",0]
[{"$nulls":4},"","","","","",0,null,"","","","","",0]
[{"$nulls":4},"","","","","",0,null,"","","","","",0]
[{"$nulls":4},"","","","","",0,null,"","","","","",0]
[{"$nulls":4},"","","","","",0,null,"","","","","",0]
[{"$nulls":4},"","","","","",0,null,"","","","","",0]
[{"$nulls":4},"","","","","",0,null,"","","","","",0]
[{"$nulls":4},"","","","","",0,null,"","","","","",0]
[{"$nulls":4},"","","","","",0,null,"","","","","",0]
[{"$nulls":4},"","","","","",0,null,"","","","","",0]
[{"$nulls":4},"","","","","",0,null,"","","","","",0]
[{"$nulls":4},"","","","","",0,null,"","","","","",0]
[{"$nulls":4},"","","","","",0,null,"","","","","",0]
[{"$nulls":4},"","","","","",0,null,"","","","","",0]
[{"$nulls":4},"","","","","",0,null,"","","","","",0]
[{"$nulls":4},"","","","","",0,null,"","","","","",0]
[{"$nulls":4},"","","","","",0,null,"","","","","",0]
[{"$nulls":4},"","","","","",0,null,"","","","","",0]
[{"$nulls":4},"","","","","",0,null,"","","","","",0]
[{"$nulls":4},"","","","","",0,null,"","","","","",0]
[{"$nulls":4},"","","","","",0,null,"","","","","",0]
[{"$nulls":4},"","","","","",0,null,"","","","","",0]
[{"$nulls":4},{"$f":"IF(ISNA(VLOOKUP(C162,round1,3,FALSE)),\"\",VLOOKUP(C162,round1,3,FALSE))","v":""},{"$f":"IF(ISNA(VLOOKUP(C162,round2,3,FALSE)),\"\",VLOOKUP(C162,round2,3,FALSE))","v":""},{"$f":"IF(ISNA(VLOOKUP(C162,round3,3,FALSE)),\"\",VLOOKUP(C162,round3,3,FALSE))","v":""},{"$f":"IF(ISNA(VLOOKUP(C162,round4,3,FALSE)),\"\",VLOOKUP(C162,round4,3,FALSE))","v":""},{"$f":"IF(ISNA(VLOOKUP(C162,round5,3,FALSE)),\"\",VLOOKUP(C162,round5,3,FALSE))","v":""},0,null,{"$f":"IF(ISNA(VLOOKUP(C162,round6,3,FALSE)),\"\",VLOOKUP(C162,round6,3,FALSE))","v":""},{"$f":"IF(ISNA(VLOOKUP(C162,round7,3,FALSE)),\"\",VLOOKUP(C162,round7,3,FALSE))","v":""},{"$f":"IF(ISNA(VLOOKUP(C162,round8,3,FALSE)),\"\",VLOOKUP(C162,round8,3,FALSE))","v":""},{"$f":"IF(ISNA(VLOOKUP(C162,round9,3,FALSE)),\"\",VLOOKUP(C162,round9,3,FALSE))","v":""},{"$f":"IF(ISNA(VLOOKUP(C162,round10,3,FALSE)),\"\",VLOOKUP(C162,round10,3,FALSE))","v":""},0]
[{"$nulls":4},"","","","","",0,null,"","","","","",0]
[{"$nulls":4},"","","","","",0,null,"","","","","",0]
[{"$nulls":4},"","","","","",0,null,"","","","","",0]
[{"$nulls":4},"","","","","",0,null,"","","","","",0]
[{"$nulls":4},"","","","","",0,null,"","","","","",0]
[{"$nulls":4},"","","","","",0,null,"","","","","",0]
[{"$nulls":4},"","","","","",0,null,"","","","","",0]
[{"$nulls":4},"","","","","",0,null,"","","","","",0]
[{"$nulls":4},"","","","","",0,null,"","","","","",0]
[{"$nulls":4},"","","","","",0,null,"","","","","",0]
[{"$nulls":4},"","","","","",0,null,"","","","","",0]
[{"$nulls":4},"","","","","",0,null,"","","","","",0]
[{"$nulls":4},"","","","","",0,null,"","","","","",0]
[{"$nulls":4},"","","","","",0,null,"","","","","",0]
[{"$nulls":4},"","","","","",0,null,"","","","","",0]
[{"$nulls":4},"","","","","",0,null,"","","","","",0]
[{"$nulls":4},"","","","","",0,null,"","","","","",0]
[{"$nulls":4},"","","","","",0,null,"","","","","",0]
[{"$nulls":4},"","","","","",0,null,"","","","","",0]
[{"$nulls":4},"","","","","",0,null,"","","","","",0]
[{"$nulls":4},"","","","","",0,null,"","","","","",0]
[{"$nulls":4},"","","","","",0,null,"","","","","",0]
[{"$nulls":4},"","","","","",0,null,"","","","","",0]
[{"$nulls":4},"","","","","",0,null,"","","","","",0]
[{"$nulls":4},"","","","","",0,null,"","","","","",0]
[{"$nulls":4},"","","","","",0,null,"","","","","",0]
[{"$nulls":4},"","","","","",0,null,"","","","","",0]
[{"$nulls":4},"","","","","",0,null,"","","","","",0]
[{"$nulls":4},"","","","","",0,null,"","","","","",0]
[{"$nulls":4},"","","","","",0,null,"","","","","",0]
[{"$nulls":4},"","","","","",0,null,"","","","","",0]
[{"$nulls":4},"","","","","",0,null,"","","","","",0]
[{"$nulls":4},"","","","","",0,null,"","","","","",0]
[{"$nulls":4},"","","","","",{"$f":"MAX(E196:I196)","v":0},null,"","","","","",{"$f":"MAX(L196:P196)","v":0}]
[{"$nulls":4},"","","","","",0,null,"","","","","",0]
[{"$nulls":4},"","","","","",0,null,"","","","","",0]
[{"$nulls":4},"","","","","",0,null,"","","","","",0]
[{"$nulls":4},"","","","","",0,null,"","","","","",0]
[{"$nulls":4},"","","","","",0,null,"","","","","",0]
[{"$nulls":4},"","","","","",0,null,"","","","","",0]
[{"$nulls":4},"","","","","",0,null,"","","","","",0]
[{"$nulls":4},"","","","","",0,null,"","","","","",0]
[{"$nulls":4},"","","","","",0,null,"","","","","",0]
[{"$nulls":4},"","","","","",0,null,"","","","","",0]
[{"$nulls":4},"","","","","",0,null,"","","","","",0]
[{"$nulls":4},"","","","","",0,null,"","","","","",0]
[{"$nulls":4},"","","","","",0,null,"","","","","",0]
[{"$nulls":4},"","","","","",0,null,"","","","","",0]
[{"$nulls":4},"","","","","",0,null,"","","","","",0]
[{"$nulls":4},"","","","","",0,null,"","","","","",0]
[{"$nulls":4},"","","","","",0,null,"","","","","",0]
[{"$nulls":4},"","","","","",0,null,"","","","","",0]
[{"$nulls":4},"","","","","",0,null,"","","","","",0]
[{"$nulls":4},"","","","","",0,null,"","","","","",0]
[{"$nulls":4},"","","","","",0,null,"","","","","",0]
[{"$nulls":4},"","","","","",0,null,"","","","","",0]
[{"$nulls":4},"","","","","",0,null,"","","","","",0]
[{"$nulls":4},"","","","","",0,null,"","","","","",0]
[{"$nulls":4},"","","","","",0,null,"","","","","",0]
[{"$nulls":4},"","","","","",0,null,"","","","","",0]
[{"$nulls":4},"","","","","",0,null,"","","","","",0]
[{"$nulls":4},"","","","","",0,null,"","","","","",0]
[{"$nulls":4},"","","","","",0,null,"","","","","",0]
[{"$nulls":4},{"$f":"IF(ISNA(VLOOKUP(C226,round1,3,FALSE)),\"\",VLOOKUP(C226,round1,3,FALSE))","v":""},{"$f":"IF(ISNA(VLOOKUP(C226,round2,3,FALSE)),\"\",VLOOKUP(C226,round2,3,FALSE))","v":""},{"$f":"IF(ISNA(VLOOKUP(C226,round3,3,FALSE)),\"\",VLOOKUP(C226,round3,3,FALSE))","v":""},{"$f":"IF(ISNA(VLOOKUP(C226,round4,3,FALSE)),\"\",VLOOKUP(C226,round4,3,FALSE))","v":""},{"$f":"IF(ISNA(VLOOKUP(C226,round5,3,FALSE)),\"\",VLOOKUP(C226,round5,3,FALSE))","v":""},0,null,{"$f":"IF(ISNA(VLOOKUP(C226,round6,3,FALSE)),\"\",VLOOKUP(C226,round6,3,FALSE))","v":""},{"$f":"IF(ISNA(VLOOKUP(C226,round7,3,FALSE)),\"\",VLOOKUP(C226,round7,3,FALSE))","v":""},{"$f":"IF(ISNA(VLOOKUP(C226,round8,3,FALSE)),\"\",VLOOKUP(C226,round8,3,FALSE))","v":""},{"$f":"IF(ISNA(VLOOKUP(C226,round9,3,FALSE)),\"\",VLOOKUP(C226,round9,3,FALSE))","v":""},{"$f":"IF(ISNA(VLOOKUP(C226,round10,3,FALSE)),\"\",VLOOKUP(C226,round10,3,FALSE))","v":""},0]
[{"$nulls":4},"","","","","",0,null,"","","","","",0]
[{"$nulls":4},"","","","","",0,null,"","","","","",0]
[{"$nulls":4},"","","","","",0,null,"","","","","",0]
[{"$nulls":4},"","","","","",0,null,"","","","","",0]
[{"$nulls":4},"","","","","",0,null,"","","","","",0]
[{"$nulls":4},"","","","","",0,null,"","","","","",0]
[{"$nulls":4},"","","","","",0,null,"","","","","",0]
[{"$nulls":4},"","","","","",0,null,"","","","","",0]
[{"$nulls":4},"","","","","",0,null,"","","","","",0]
[{"$nulls":4},"","","","","",0,null,"","","","","",0]
[{"$nulls":4},"","","","","",0,null,"","","","","",0]
[{"$nulls":4},"","","","","",0,null,"","","","","",0]
[{"$nulls":4},"","","","","",0,null,"","","","","",0]
[{"$nulls":4},"","","","","",0,null,"","","","","",0]
[{"$nulls":4},"","","","","",0,null,"","","","","",0]
[{"$nulls":4},"","","","","",0,null,"","","","","",0]
[{"$nulls":4},"","","","","",0,null,"","","","","",0]
[{"$nulls":4},"","","","","",0,null,"","","","","",0]
[{"$nulls":4},"","","","","",0,null,"","","","","",0]
[{"$nulls":4},"","","","","",0,null,"","","","","",0]
[{"$nulls":4},"","","","","",0,null,"","","","","",0]
[{"$nulls":4},"","","","","",0,null,"","","","","",0]
[{"$nulls":4},"","","","","",0,null,"","","","","",0]
[{"$nulls":4},"","","","","",0,null,"","","","","",0]
[{"$nulls":4},"","","","","",0,null,"","","","","",0]

{"sheet":"Sheet1","index":9,"n_rows":48,"n_cols":4,"rows_kept":48,"hidden":true}
["a",null,100001,1]
["b",null,100002,2]
["c",null,100003,3]
["d",null,100004,4]
["e",null,100005,5]
["f",null,100006,6]
["g",null,100007,7]
["h",null,100008,8]
["i",null,100009,9]
["j",null,100010,10]
["k",null,100011,11]
["l",null,100012,12]
["m",null,100013,13]
["n",null,100014,14]
["o",null,100015,15]
["p",null,100016,16]
["q",null,100017,17]
["r",null,100018,18]
["s",null,100019,19]
["t",null,100020,20]
["u",null,100021,21]
["v",null,100022,22]
["w",null,100023,23]
["x",null,100024,24]
["y",null,100025,25]
["z",null,100026,26]
["aa",null,100027,27]
["bb",null,100028,28]
["cc",null,100029,29]
["dd",null,100030,30]
["ee",null,100031,31]
["ff",null,100032,32]
["gg",null,100033,33]
["hh",null,100034,34]
["ii",null,100035,35]
["jj",null,100036,36]
["kk",null,100037,37]
["ll",null,100038,38]
["mm",null,100039,39]
["nn",null,100040,40]
["oo",null,100041,41]
["pp",null,100042,42]
["qq",null,100043,43]
["rr",null,100044,44]
["ss",null,100045,45]
["tt",null,100046,46]
["uu",null,100047,47]
["vv",null,100048,48]

{"sheet":"Results","index":10,"n_rows":222,"n_cols":32,"rows_kept":222,"hidden":true,"merged":[[0,0,0,31],[1,0,1,31],[2,0,2,2],[2,3,2,4],[2,5,2,9],[2,13,2,16],[2,19,2,25],[2,26,2,31],[4,0,4,2],[4,3,4,11],[4,12,4,13],[4,14,4,15],[4,16,4,18],[4,19,4,27],[4,28,4,29],[4,30,4,31],[5,0,5,10],[5,11,5,13],[5,14,5,15],[5,16,5,26],[5,27,5,29],[5,30,5,31],[6,0,6,1],[6,2,6,10],[6,11,6,13],[6,14,9,15],[6,16,6,17],[6,18,6,26],[6,27,6,29],[6,30,9,31],[7,0,7,1],[7,2,7,10],[7,11,7,13],[7,16,7,17],[7,18,7,26],[7,27,7,29],[8,0,8,1],[8,2,8,10],[8,11,8,13],[8,16,8,17],[8,18,8,26],[8,27,8,29],[9,0,9,1],[9,2,9,10],[9,11,9,13],[9,16,9,17],[9,18,9,26],[9,27,9,29],[10,0,10,1],[10,2,10,10],[10,11,10,13],[10,14,13,15],[10,16,10,17],[10,18,10,26],[10,27,10,29],[10,30,13,31],[11,0,11,1],[11,2,11,10],[11,11,11,13],[11,16,11,17],[11,18,11,26],[11,27,11,29],[12,0,12,1],[12,2,12,10],[12,11,12,13],[12,16,12,17],[12,18,12,26],[12,27,12,29],[13,0,13,1],[13,2,13,10],[13,11,13,13],[13,16,13,17],[13,18,13,26],[13,27,13,29],[14,0,14,4],[14,5,14,6],[14,11,14,13],[14,14,14,15],[14,16,14,20],[14,21,14,22],[14,27,14,29],[14,30,14,31],[15,0,15,4],[15,5,15,6],[15,11,15,13],[15,14,15,15],[15,16,15,20],[15,21,15,22],[15,27,15,29],[15,30,15,31],[16,0,16,4],[16,5,16,6],[16,11,16,13],[16,14,16,15],[16,16,16,20],[16,21,16,22],[16,27,16,29],[16,30,16,31],[17,0,17,6],[17,7,17,15],[18,0,18,11],[18,12,18,21],[18,25,18,31],[19,0,19,11],[19,12,19,21],[19,25,19,31],[20,0,20,3],[20,4,20,21],[20,26,20,28],[21,4,21,21],[22,4,22,21],[23,4,23,21],[23,26,23,28],[24,4,24,21],[24,26,24,28],[25,0,25,31],[26,0,26,31],[27,0,27,2],[27,3,27,4],[27,5,27,9],[27,13,27,16],[27,19,27,25],[27,26,27,31],[29,0,29,2],[29,3,29,11],[29,12,29,13],[29,14,29,15],[29,16,29,18],[29,19,29,27],[29,28,29,29],[29,30,29,31],[30,0,30,10],[30,11,30,13],[30,14,30,15],[30,16,30,26],[30,27,30,29],[30,30,30,31],[31,0,31,1],[31,2,31,10],[31,11,31,13],[31,14,34,15],[31,16,31,17],[31,18,31,26],[31,27,31,29],[31,30,34,31],[32,0,32,1],[32,2,32,10],[32,11,32,13],[32,16,32,17],[32,18,32,26],[32,27,32,29],[33,0,33,1],[33,2,33,10],[33,11,33,13],[33,16,33,17],[33,18,33,26],[33,27,33,29],[34,0,34,1],[34,2,34,10],[34,11,34,13],[34,16,34,17],[34,18,34,26],[34,27,34,29],[35,0,35,1],[35,2,35,10],[35,11,35,13],[35,14,38,15],[35,16,35,17],[35,18,35,26],[35,27,35,29],[35,30,38,31],[36,0,36,1],[36,2,36,10],[36,11,36,13],[36,16,36,17],[36,18,36,26],[36,27,36,29],[37,0,37,1],[37,2,37,10],[37,11,37,13],[37,16,37,17],[37,18,37,26],[37,27,37,29],[38,0,38,1],[38,2,38,10],[38,11,38,13],[38,16,38,17],[38,18,38,26],[38,27,38,29],[39,0,39,4],[39,5,39,6],[39,11,39,13],[39,14,39,15],[39,16,39,20],[39,21,39,22],[39,27,39,29],[39,30,39,31],[40,0,40,4],[40,5,40,6],[40,11,40,13],[40,14,40,15],[40,16,40,20],[40,21,40,22],[40,27,40,29],[40,30,40,31],[41,0,41,4],[41,5,41,6],[41,11,41,13],[41,14,41,15],[41,16,41,20],[41,21,41,22],[41,27,41,29],[41,30,41,31],[42,0,42,6],[42,7,42,15],[43,0,43,11],[43,12,43,21],[43,25,43,31],[44,0,44,11],[44,12,44,21],[44,25,44,31],[45,0,45,3],[45,4,45,21],[45,26,45,28],[46,4,46,21],[47,4,47,21],[48,4,48,21],[48,26,48,28],[49,4,49,21],[49,26,49,28],[50,0,50,31],[51,0,51,31],[52,0,52,2],[52,3,52,4],[52,5,52,9],[52,13,52,16],[52,19,52,25],[52,26,52,31],[54,0,54,2],[54,3,54,11],[54,12,54,13],[54,14,54,15],[54,16,54,18],[54,19,54,27],[54,28,54,29],[54,30,54,31],[55,0,55,10],[55,11,55,13],[55,14,55,15],[55,16,55,26],[55,27,55,29],[55,30,55,31],[56,0,56,1],[56,2,56,10],[56,11,56,13],[56,14,59,15],[56,16,56,17],[56,18,56,26],[56,27,56,29],[56,30,59,31],[57,0,57,1],[57,2,57,10],[57,11,57,13],[57,16,57,17],[57,18,57,26],[57,27,57,29],[58,0,58,1],[58,2,58,10],[58,11,58,13],[58,16,58,17],[58,18,58,26],[58,27,58,29],[59,0,59,1],[59,2,59,10],[59,11,59,13],[59,16,59,17],[59,18,59,26],[59,27,59,29],[60,0,60,1],[60,2,60,10],[60,11,60,13],[60,14,63,15],[60,16,60,17],[60,18,60,26],[60,27,60,29],[60,30,63,31],[61,0,61,1],[61,2,61,10],[61,11,61,13],[61,16,61,17],[61,18,61,26],[61,27,61,29],[62,0,62,1],[62,2,62,10],[62,11,62,13],[62,16,62,17],[62,18,62,26],[62,27,62,29],[63,0,63,1],[63,2,63,10],[63,11,63,13],[63,16,63,17],[63,18,63,26],[63,27,63,29],[64,0,64,4],[64,5,64,6],[64,11,64,13],[64,14,64,15],[64,16,64,20],[64,21,64,22],[64,27,64,29],[64,30,64,31],[65,0,65,4],[65,5,65,6],[65,11,65,13],[65,14,65,15],[65,16,65,20],[65,21,65,22],[65,27,65,29],[65,30,65,31],[66,0,66,4],[66,5,66,6],[66,11,66,13],[66,14,66,15],[66,16,66,20],[66,21,66,22],[66,27,66,29],[66,30,66,31],[67,0,67,6],[67,7,67,15],[68,0,68,11],[68,12,68,21],[68,25,68,31],[69,0,69,11],[69,12,69,21],[69,25,69,31],[70,0,70,3],[70,4,70,21],[70,26,70,28],[71,4,71,21],[72,4,72,21],[73,4,73,21],[73,26,73,28],[74,4,74,21],[74,26,74,28],[75,0,75,31],[76,0,76,31],[77,0,77,2],[77,3,77,4],[77,5,77,9],[77,13,77,16],[77,19,77,25],[77,26,77,31],[79,0,79,2],[79,3,79,11],[79,12,79,13],[79,14,79,15],[79,16,79,18],[79,19,79,27],[79,28,79,29],[79,30,79,31],[80,0,80,10],[80,11,80,13],[80,14,80,15],[80,16,80,26],[80,27,80,29],[80,30,80,31],[81,0,81,1],[81,2,81,10],[81,11,81,13],[81,14,84,15],[81,16,81,17],[81,18,81,26],[81,27,81,29],[81,30,84,31],[82,0,82,1],[82,2,82,10],[82,11,82,13],[82,16,82,17],[82,18,82,26],[82,27,82,29],[83,0,83,1],[83,2,83,10],[83,11,83,13],[83,16,83,17],[83,18,83,26],[83,27,83,29],[84,0,84,1],[84,2,84,10],[84,11,84,13],[84,16,84,17],[84,18,84,26],[84,27,84,29],[85,0,85,1],[85,2,85,10],[85,11,85,13],[85,14,88,15],[85,16,85,17],[85,18,85,26],[85,27,85,29],[85,30,88,31],[86,0,86,1],[86,2,86,10],[86,11,86,13],[86,16,86,17],[86,18,86,26],[86,27,86,29],[87,0,87,1],[87,2,87,10],[87,11,87,13],[87,16,87,17],[87,18,87,26],[87,27,87,29],[88,0,88,1],[88,2,88,10],[88,11,88,13],[88,16,88,17],[88,18,88,26],[88,27,88,29],[89,0,89,4],[89,5,89,6],[89,11,89,13],[89,14,89,15],[89,16,89,20],[89,21,89,22],[89,27,89,29],[89,30,89,31],[90,0,90,4],[90,5,90,6],[90,11,90,13],[90,14,90,15],[90,16,90,20],[90,21,90,22],[90,27,90,29],[90,30,90,31],[91,0,91,4],[91,5,91,6],[91,11,91,13],[91,14,91,15],[91,16,91,20],[91,21,91,22],[91,27,91,29],[91,30,91,31],[92,0,92,6],[92,7,92,15],[93,0,93,11],[93,12,93,21],[93,25,93,31],[94,0,94,11],[94,12,94,21],[94,25,94,31],[95,0,95,3],[95,4,95,21],[95,26,95,28],[96,4,96,21],[97,4,97,21],[98,4,98,21],[98,26,98,28],[99,4,99,21],[99,26,99,28],[100,0,100,31],[101,0,101,31],[102,0,102,2],[102,3,102,4],[102,5,102,9],[102,13,102,16],[102,19,102,25],[102,26,102,31],[104,0,104,2],[104,3,104,11],[104,12,104,13],[104,14,104,15],[104,16,104,18],[104,19,104,27],[104,28,104,29],[104,30,104,31],[105,0,105,10],[105,11,105,13],[105,14,105,15],[105,16,105,26],[105,27,105,29],[105,30,105,31],[106,0,106,1],[106,2,106,10],[106,11,106,13],[106,14,109,15],[106,16,106,17],[106,18,106,26],[106,27,106,29],[106,30,109,31],[107,0,107,1],[107,2,107,10],[107,11,107,13],[107,16,107,17],[107,18,107,26],[107,27,107,29],[108,0,108,1],[108,2,108,10],[108,11,108,13],[108,16,108,17],[108,18,108,26],[108,27,108,29],[109,0,109,1],[109,2,109,10],[109,11,109,13],[109,16,109,17],[109,18,109,26],[109,27,109,29],[110,0,110,1],[110,2,110,10],[110,11,110,13],[110,14,113,15],[110,16,110,17],[110,18,110,26],[110,27,110,29],[110,30,113,31],[111,0,111,1],[111,2,111,10],[111,11,111,13],[111,16,111,17],[111,18,111,26],[111,27,111,29],[112,0,112,1],[112,2,112,10],[112,11,112,13],[112,16,112,17],[112,18,112,26],[112,27,112,29],[113,0,113,1],[113,2,113,10],[113,11,113,13],[113,16,113,17],[113,18,113,26],[113,27,113,29],[114,0,114,4],[114,5,114,6],[114,11,114,13],[114,14,114,15],[114,16,114,20],[114,21,114,22],[114,27,114,29],[114,30,114,31],[115,0,115,4],[115,5,115,6],[115,11,115,13],[115,14,115,15],[115,16,115,20],[115,21,115,22],[115,27,115,29],[115,30,115,31],[116,0,116,4],[116,5,116,6],[116,11,116,13],[116,14,116,15],[116,16,116,20],[116,21,116,22],[116,27,116,29],[116,30,116,31],[117,0,117,6],[117,7,117,15],[118,0,118,11],[118,12,118,21],[118,25,118,31],[119,0,119,11],[119,12,119,21],[119,25,119,31],[120,0,120,3],[120,4,120,21],[121,4,121,21],[122,4,122,21],[123,4,123,21],[124,4,124,21],[125,0,125,31],[126,0,126,31],[127,0,127,2],[127,19,127,25],[129,3,129,11],[129,12,129,13],[130,0,130,10],[130,11,130,13],[130,16,130,26],[130,27,130,29],[130,30,130,31],[131,0,131,1],[131,2,131,10],[131,11,131,13],[131,14,134,15],[131,16,131,17],[131,18,131,26],[131,27,131,29],[131,30,134,31],[132,0,132,1],[132,2,132,10],[132,11,132,13],[132,16,132,17],[132,18,132,26],[132,27,132,29],[133,0,133,1],[133,2,133,10],[133,11,133,13],[133,16,133,17],[133,18,133,26],[133,27,133,29],[134,0,134,1],[134,2,134,10],[134,11,134,13],[134,16,134,17],[134,18,134,26],[134,27,134,29],[135,0,135,1],[135,2,135,10],[135,11,135,13],[135,14,138,15],[135,16,135,17],[135,18,135,26],[135,27,135,29],[135,30,138,31],[136,0,136,1],[136,2,136,10],[136,11,136,13],[136,16,136,17],[136,18,136,26],[136,27,136,29],[137,0,137,1],[137,2,137,10],[137,11,137,13],[137,16,137,17],[137,18,137,26],[137,27,137,29],[138,0,138,1],[138,2,138,10],[138,11,138,13],[138,16,138,17],[138,18,138,26],[138,27,138,29],[139,0,139,4],[139,5,139,6],[139,11,139,13],[139,14,139,15],[139,16,139,20],[139,21,139,22],[139,27,139,29],[139,30,139,31],[140,0,140,4],[140,5,140,6],[140,11,140,13],[140,14,140,15],[140,16,140,20],[140,21,140,22],[140,27,140,29],[140,30,140,31],[141,11,141,13],[141,14,141,15],[141,30,141,31],[143,25,143,31],[144,25,144,31],[145,26,145,28],[147,4,147,21],[148,4,148,21],[148,26,148,28],[149,26,149,28],[150,0,150,31],[152,0,152,2],[152,3,152,4],[152,5,152,9],[152,13,152,16],[152,19,152,25],[152,26,152,31],[154,0,154,2],[154,3,154,11],[154,12,154,13],[154,14,154,15],[154,16,154,18],[154,19,154,27],[154,28,154,29],[154,30,154,31],[155,0,155,10],[155,11,155,13],[155,14,155,15],[155,16,155,26],[155,27,155,29],[155,30,155,31],[156,0,156,1],[156,2,156,10],[156,11,156,13],[156,14,159,15],[156,16,156,17],[156,18,156,26],[156,27,156,29],[156,30,159,31],[157,0,157,1],[157,2,157,10],[157,11,157,13],[157,16,157,17],[157,18,157,26],[157,27,157,29],[158,0,158,1],[158,2,158,10],[158,11,158,13],[158,16,158,17],[158,18,158,26],[158,27,158,29],[159,0,159,1],[159,2,159,10],[159,11,159,13],[159,16,159,17],[159,18,159,26],[159,27,159,29],[160,0,160,1],[160,2,160,10],[160,11,160,13],[160,14,163,15],[160,16,160,17],[160,18,160,26],[160,27,160,29],[160,30,163,31],[161,0,161,1],[161,2,161,10],[161,11,161,13],[161,16,161,17],[161,18,161,26],[161,27,161,29],[162,0,162,1],[162,2,162,10],[162,11,162,13],[162,16,162,17],[162,18,162,26],[162,27,162,29],[163,0,163,1],[163,2,163,10],[163,11,163,13],[163,16,163,17],[163,18,163,26],[163,27,163,29],[164,0,164,4],[164,5,164,6],[164,11,164,13],[164,14,164,15],[164,16,164,20],[164,21,164,22],[164,27,164,29],[164,30,164,31],[165,0,165,4],[165,5,165,6],[165,11,165,13],[165,14,165,15],[165,16,165,20],[165,21,165,22],[165,27,165,29],[165,30,165,31],[166,0,166,4],[166,5,166,6],[166,11,166,13],[166,14,166,15],[166,16,166,20],[166,21,166,22],[166,27,166,29],[166,30,166,31],[167,0,167,6],[167,7,167,15],[168,0,168,11],[168,12,168,21],[168,24,168,30],[169,0,169,11],[169,12,169,21],[169,24,169,30],[170,0,170,3],[170,4,170,21],[170,25,170,27],[171,4,171,21],[172,4,172,21],[172,25,172,27],[173,4,173,21],[173,25,173,27],[174,0,174,31],[176,0,176,2],[176,3,176,4],[176,5,176,9],[176,13,176,16],[176,19,176,25],[176,26,176,31],[178,0,178,2],[178,3,178,11],[178,12,178,13],[178,14,178,15],[178,16,178,18],[178,19,178,27],[178,28,178,29],[178,30,178,31],[179,0,179,10],[179,11,179,13],[179,14,179,15],[179,16,179,26],[179,27,179,29],[179,30,179,31],[180,0,180,1],[180,2,180,10],[180,11,180,13],[180,14,183,15],[180,16,180,17],[180,18,180,26],[180,27,180,29],[180,30,183,31],[181,0,181,1],[181,2,181,10],[181,11,181,13],[181,16,181,17],[181,18,181,26],[181,27,181,29],[182,0,182,1],[182,2,182,10],[182,11,182,13],[182,16,182,17],[182,18,182,26],[182,27,182,29],[183,0,183,1],[183,2,183,10],[183,11,183,13],[183,16,183,17],[183,18,183,26],[183,27,183,29],[184,0,184,1],[184,2,184,10],[184,11,184,13],[184,14,187,15],[184,16,184,17],[184,18,184,26],[184,27,184,29],[184,30,187,31],[185,0,185,1],[185,2,185,10],[185,11,185,13],[185,16,185,17],[185,18,185,26],[185,27,185,29],[186,0,186,1],[186,2,186,10],[186,11,186,13],[186,16,186,17],[186,18,186,26],[186,27,186,29],[187,0,187,1],[187,2,187,10],[187,11,187,13],[187,16,187,17],[187,18,187,26],[187,27,187,29],[188,0,188,4],[188,5,188,6],[188,11,188,13],[188,14,188,15],[188,16,188,20],[188,21,188,22],[188,27,188,29],[188,30,188,31],[189,0,189,4],[189,5,189,6],[189,11,189,13],[189,14,189,15],[189,16,189,20],[189,21,189,22],[189,27,189,29],[189,30,189,31],[190,0,190,4],[190,5,190,6],[190,11,190,13],[190,14,190,15],[190,16,190,20],[190,21,190,22],[190,27,190,29],[190,30,190,31],[191,0,191,6],[191,7,191,15],[192,0,192,11],[192,12,192,21],[192,24,192,30],[193,0,193,11],[193,12,193,21],[193,24,193,30],[194,0,194,3],[194,4,194,21],[194,25,194,27],[195,4,195,21],[196,4,196,21],[196,25,196,27],[197,4,197,21],[197,25,197,27],[198,0,198,31],[200,0,200,2],[200,3,200,4],[200,5,200,9],[200,13,200,16],[200,19,200,25],[200,26,200,31],[202,0,202,2],[202,3,202,11],[202,12,202,13],[202,14,202,15],[202,16,202,18],[202,19,202,27],[202,28,202,29],[202,30,202,31],[203,0,203,10],[203,11,203,13],[203,14,203,15],[203,16,203,26],[203,27,203,29],[203,30,203,31],[204,0,204,1],[204,2,204,10],[204,11,204,13],[204,14,207,15],[204,16,204,17],[204,18,204,26],[204,27,204,29],[204,30,207,31],[205,0,205,1],[205,2,205,10],[205,11,205,13],[205,16,205,17],[205,18,205,26],[205,27,205,29],[206,0,206,1],[206,2,206,10],[206,11,206,13],[206,16,206,17],[206,18,206,26],[206,27,206,29],[207,0,207,1],[207,2,207,10],[207,11,207,13],[207,16,207,17],[207,18,207,26],[207,27,207,29],[208,0,208,1],[208,2,208,10],[208,11,208,13],[208,14,211,15],[208,16,208,17],[208,18,208,26],[208,27,208,29],[208,30,211,31],[209,0,209,1],[209,2,209,10],[209,11,209,13],[209,16,209,17],[209,18,209,26],[209,27,209,29],[210,0,210,1],[210,2,210,10],[210,11,210,13],[210,16,210,17],[210,18,210,26],[210,27,210,29],[211,0,211,1],[211,2,211,10],[211,11,211,13],[211,16,211,17],[211,18,211,26],[211,27,211,29],[212,0,212,4],[212,5,212,6],[212,11,212,13],[212,14,212,15],[212,16,212,20],[212,21,212,22],[212,27,212,29],[212,30,212,31],[213,0,213,4],[213,5,213,6],[213,11,213,13],[213,14,213,15],[213,16,213,20],[213,21,213,22],[213,27,213,29],[213,30,213,31],[214,0,214,4],[214,5,214,6],[214,11,214,13],[214,14,214,15],[214,16,214,20],[214,21,214,22],[214,27,214,29],[214,30,214,31],[215,0,215,6],[215,7,215,15],[216,0,216,11],[216,12,216,21],[216,24,216,30],[217,0,217,11],[217,12,217,21],[217,24,217,30],[218,0,218,3],[218,4,218,21],[218,25,218,27],[219,4,219,21],[220,4,220,21],[220,25,220,27],[221,4,221,21],[221,25,221,27]],"merged_total":1029,"flags":["merged_cut"]}
["CENTRAL COAST DISTRICT WOMEN'S BOWLING ASSOCIATION - PENNANT RETURN SHEET"]
["OFFICIAL SHEET 2019"]
["GRADE No.",null,null,{"$f":"'PENNANT TEAMS'!$A$8","v":1},null,"SECTION No.",{"$nulls":4},{"$f":"'PENNANT TEAMS'!$C$12","v":1},null,null,"ROUND No.",{"$nulls":3},{"$f":"'PENNANT TEAMS'!$B$5","v":2},null,"DATE OF MATCH",{"$nulls":6},{"$f":"'PENNANT TEAMS'!$B$4","v":"3rd March"},{"$f":"'PENNANT TEAMS'!$B$5","v":"1900-01-02"},{"$f":"'PENNANT TEAMS'!$B$5","v":"1900-01-02"},{"$f":"'PENNANT TEAMS'!$B$5","v":"1900-01-02"},{"$f":"'PENNANT TEAMS'!$B$5","v":"1900-01-02"},{"$f":"'PENNANT TEAMS'!$B$5","v":"1900-01-02"}]
[]
["HOME SIDE CLUB NAME:",null,null,{"$f":"IF('PENNANT TEAMS'!$B$7=\"Home\",'PENNANT TEAMS'!$C$3,IF('PENNANT TEAMS'!$B$7=\"away\",'PENNANT TEAMS'!$D$7,\"\"))","v":"Avoca"},{"$nulls":8},"Side No.",null,{"$f":"IF('PENNANT TEAMS'!$B$7=\"home\",'PENNANT TEAMS'!$E$12,\"\")","v":""},null,"VISITING SIDE CLUB NAME:",null,null,{"$f":"IF('PENNANT TEAMS'!$B$7=\"Home\",'PENNANT TEAMS'!$D$7,IF('PENNANT TEAMS'!$B$7=\"away\",'PENNANT TEAMS'!$C$3,\"\"))","v":"Your club name here"},{"$nulls":8},"Side No.",null,{"$f":"IF('PENNANT TEAMS'!$B$7=\"away\",'PENNANT TEAMS'!$E$12,\"\")","v":"red"}]
["FULL NAMES OF PLAYERS TO BE PRINTED",{"$nulls":10},"REGISTRATION NUMBER",null,null,"SCORE",null,"FULL NAMES OF PLAYERS TO BE PRINTED",{"$nulls":10},"REGISTRATION NUMBER",null,null,"SCORE"]
["Lead",null,{"$f":"IF('PENNANT TEAMS'!$B$7=\"home\",'PENNANT TEAMS'!$B$8,\"\")","v":""},{"$nulls":8},{"$f":"IF('PENNANT TEAMS'!$B$7=\"HOME\",'PENNANT TEAMS'!$B$9,\"\")","v":""},{"$nulls":4},"Lead",null,{"$f":"IF('PENNANT TEAMS'!$B$7=\"away\",'PENNANT TEAMS'!$B$8,\"\")","v":0},{"$nulls":8},{"$f":"IF('PENNANT TEAMS'!$B$7=\"away\",'PENNANT TEAMS'!$B$9,\"\")","v":""}]
["Second",null,{"$f":"IF('PENNANT TEAMS'!$B$7=\"home\",'PENNANT TEAMS'!$C$8,\"\")","v":""},{"$nulls":8},{"$f":"IF('PENNANT TEAMS'!$B$7=\"HOME\",'PENNANT TEAMS'!$C$9,\"\")","v":""},{"$nulls":4},"Second",null,{"$f":"IF('PENNANT TEAMS'!$B$7=\"away\",'PENNANT TEAMS'!$C$8,\"\")","v":0},{"$nulls":8},{"$f":"IF('PENNANT TEAMS'!$B$7=\"away\",'PENNANT TEAMS'!$C$9,\"\")","v":""}]
["Third",null,{"$f":"IF('PENNANT TEAMS'!$B$7=\"home\",'PENNANT TEAMS'!$D$8,\"\")","v":""},{"$nulls":8},{"$f":"IF('PENNANT TEAMS'!$B$7=\"HOME\",'PENNANT TEAMS'!$D$9,\"\")","v":""},{"$nulls":4},"Third",null,{"$f":"IF('PENNANT TEAMS'!$B$7=\"away\",'PENNANT TEAMS'!$D$8,\"\")","v":0},{"$nulls":8},{"$f":"IF('PENNANT TEAMS'!$B$7=\"away\",'PENNANT TEAMS'!$D$9,\"\")","v":""}]
["Skip",null,{"$f":"IF('PENNANT TEAMS'!$B$7=\"home\",'PENNANT TEAMS'!$E$8,\"\")","v":""},{"$nulls":8},{"$f":"IF('PENNANT TEAMS'!$B$7=\"HOME\",'PENNANT TEAMS'!$E$9,\"\")","v":""},{"$nulls":4},"Skip",null,{"$f":"IF('PENNANT TEAMS'!$B$7=\"away\",'PENNANT TEAMS'!$E$8,\"\")","v":0},{"$nulls":8},{"$f":"IF('PENNANT TEAMS'!$B$7=\"away\",'PENNANT TEAMS'!$E$9,\"\")","v":""}]
["Lead",null,{"$f":"IF('PENNANT TEAMS'!$B$7=\"home\",'PENNANT TEAMS'!$B$10,\"\")","v":""},{"$nulls":8},{"$f":"IF('PENNANT TEAMS'!$B$7=\"HOME\",'PENNANT TEAMS'!$B$11,\"\")","v":""},{"$nulls":4},"Lead",null,{"$f":"IF('PENNANT TEAMS'!$B$7=\"away\",'PENNANT TEAMS'!$B$10,\"\")","v":0},{"$nulls":8},{"$f":"IF('PENNANT TEAMS'!$B$7=\"away\",'PENNANT TEAMS'!$B$11,\"\")","v":""}]
["Second",null,{"$f":"IF('PENNANT TEAMS'!$B$7=\"home\",'PENNANT TEAMS'!$C$10,\"\")","v":""},{"$nulls":8},{"$f":"IF('PENNANT TEAMS'!$B$7=\"HOME\",'PENNANT TEAMS'!$C$11,\"\")","v":""},{"$nulls":4},"Second",null,{"$f":"IF('PENNANT TEAMS'!$B$7=\"away\",'PENNANT TEAMS'!$C$10,\"\")","v":0},{"$nulls":8},{"$f":"IF('PENNANT TEAMS'!$B$7=\"away\",'PENNANT TEAMS'!$C$11,\"\")","v":""}]
["Third",null,{"$f":"IF('PENNANT TEAMS'!$B$7=\"home\",'PENNANT TEAMS'!$D$10,\"\")","v":""},{"$nulls":8},{"$f":"IF('PENNANT TEAMS'!$B$7=\"HOME\",'PENNANT TEAMS'!$D$11,\"\")","v":""},{"$nulls":4},"Third",null,{"$f":"IF('PENNANT TEAMS'!$B$7=\"away\",'PENNANT TEAMS'!$D$10,\"\")","v":0},{"$nulls":8},{"$f":"IF('PENNANT TEAMS'!$B$7=\"away\",'PENNANT TEAMS'!$D$11,\"\")","v":""}]
["Skip",null,{"$f":"IF('PENNANT TEAMS'!$B$7=\"home\",'PENNANT TEAMS'!$E$10,\"\")","v":""},{"$nulls":8},{"$f":"IF('PENNANT TEAMS'!$B$7=\"HOME\",'PENNANT TEAMS'!$E$11,\"\")","v":""},{"$nulls":4},"Skip",null,{"$f":"IF('PENNANT TEAMS'!$B$7=\"away\",'PENNANT TEAMS'!$E$10,\"\")","v":0},{"$nulls":8},{"$f":"IF('PENNANT TEAMS'!$B$7=\"away\",'PENNANT TEAMS'!$E$11,\"\")","v":""}]
[{"$nulls":11},"TOTAL SCORE",{"$nulls":15},"TOTAL SCORE"]
[{"$nulls":11},"RINK WINS",{"$nulls":15},"RINK WINS"]
[{"$nulls":11},"POINTS TOTAL",{"$nulls":9},"½",{"$nulls":5},"POINTS TOTAL"]
["NAME OF WINNING CLUB"]
["Signature and Registration No. of Home Side Manager",{"$nulls":24},"POINT SCORING"]
["Signature and Registration No. of Visiting Side Manager",{"$nulls":24},"[Max Points = 5]"]
["PLEASE NOTE:",{"$nulls":3},"Only One (1) Return Sheet is provided for the Manager of the Home Side.",{"$nulls":21},"Match Win",null,null,"=",3]
[{"$nulls":4},"On completion of the Match, both Managers must fill in the Pennant Return and sign it.",{"$nulls":21},"Match Draw",null,null,"=","1½"]
[{"$nulls":4},"Also attach the two (2) cards from the Match Losing side shall be brought to next Delegates meeting. "]
[{"$nulls":4},"The HOME SIDE then faxes the Pennant Return to the District Chairman of Match:",{"$nulls":21},"Team Win",null,null,"=",1]
[{"$nulls":4},"Pattie Payne FAX NO. 43431621 immediatley after the game.",{"$nulls":21},"Team Draw",null,null,"=","½"]
["CENTRAL COAST DISTRICT WOMEN'S BOWLING ASSOCIATION - PENNANT RETURN SHEET"]
["OFFICIAL SHEET 2019"]
["GRADE No.",null,null,{"$f":"'PENNANT TEAMS'!$A$15","v":2},null,"SECTION No.",{"$nulls":4},{"$f":"'PENNANT TEAMS'!$C$19","v":2},null,null,"ROUND No.",{"$nulls":3},{"$f":"'PENNANT TEAMS'!$B$5","v":2},null,"DATE OF MATCH",{"$nulls":6},{"$f":"'PENNANT TEAMS'!$B$4","v":"3rd March"},{"$f":"'PENNANT TEAMS'!$B$5","v":"1900-01-02"},{"$f":"'PENNANT TEAMS'!$B$5","v":"1900-01-02"},{"$f":"'PENNANT TEAMS'!$B$5","v":"1900-01-02"},{"$f":"'PENNANT TEAMS'!$B$5","v":"1900-01-02"},{"$f":"'PENNANT TEAMS'!$B$5","v":"1900-01-02"}]
[]
["HOME SIDE CLUB NAME:",null,null,{"$f":"IF('PENNANT TEAMS'!$B$14=\"Home\",'PENNANT TEAMS'!$C$3,IF('PENNANT TEAMS'!$B$14=\"away\",'PENNANT TEAMS'!$D$14,\"\"))","v":"The Entrance"},{"$nulls":8},"Side No.",null,{"$f":"IF('PENNANT TEAMS'!$B$14=\"home\",'PENNANT TEAMS'!$E$19,\"\")","v":""},null,"VISITING SIDE CLUB NAME:",null,null,{"$f":"IF('PENNANT TEAMS'!$B$14=\"Home\",'PENNANT TEAMS'!$D$14,IF('PENNANT TEAMS'!$B$14=\"away\",'PENNANT TEAMS'!$C$3,\"\"))","v":"Your club name here"},{"$nulls":8},"Side No.",null,{"$f":"IF('PENNANT TEAMS'!$B$14=\"away\",'PENNANT TEAMS'!$E$19,\"\")","v":0}]
["FULL NAMES OF PLAYERS TO BE PRINTED",{"$nulls":10},"REGISTRATION NUMBER",null,null,"SCORE",null,"FULL NAMES OF PLAYERS TO BE PRINTED",{"$nulls":10},"REGISTRATION NUMBER",null,null,"SCORE"]
["Lead",null,{"$f":"IF('PENNANT TEAMS'!$B$14=\"home\",'PENNANT TEAMS'!$B$15,\"\")","v":""},{"$nulls":8},{"$f":"IF('PENNANT TEAMS'!$B$14=\"HOME\",'PENNANT TEAMS'!$B$16,\"\")","v":""},{"$nulls":4},"Lead",null,{"$f":"IF('PENNANT TEAMS'!$B$14=\"away\",'PENNANT TEAMS'!$B$15,\"\")","v":0},{"$nulls":8},{"$f":"IF('PENNANT TEAMS'!$B$14=\"away\",'PENNANT TEAMS'!$B$16,\"\")","v":""}]
["Second",null,{"$f":"IF('PENNANT TEAMS'!$B$14=\"home\",'PENNANT TEAMS'!$C$15,\"\")","v":""},{"$nulls":8},{"$f":"IF('PENNANT TEAMS'!$B$14=\"HOME\",'PENNANT TEAMS'!$C$16,\"\")","v":""},{"$nulls":4},"Second",null,{"$f":"IF('PENNANT TEAMS'!$B$14=\"away\",'PENNANT TEAMS'!$C$15,\"\")","v":0},{"$nulls":8},{"$f":"IF('PENNANT TEAMS'!$B$14=\"away\",'PENNANT TEAMS'!$C$16,\"\")","v":""}]
["Third",null,{"$f":"IF('PENNANT TEAMS'!$B$14=\"home\",'PENNANT TEAMS'!$D$15,\"\")","v":""},{"$nulls":8},{"$f":"IF('PENNANT TEAMS'!$B$14=\"HOME\",'PENNANT TEAMS'!$D$16,\"\")","v":""},{"$nulls":4},"Third",null,{"$f":"IF('PENNANT TEAMS'!$B$14=\"away\",'PENNANT TEAMS'!$D$15,\"\")","v":0},{"$nulls":8},{"$f":"IF('PENNANT TEAMS'!$B$14=\"away\",'PENNANT TEAMS'!$D$16,\"\")","v":""}]
["Skip",null,{"$f":"IF('PENNANT TEAMS'!$B$14=\"home\",'PENNANT TEAMS'!$E$15,\"\")","v":""},{"$nulls":8},{"$f":"IF('PENNANT TEAMS'!$B$14=\"HOME\",'PENNANT TEAMS'!$E$16,\"\")","v":""},{"$nulls":4},"Skip",null,{"$f":"IF('PENNANT TEAMS'!$B$14=\"away\",'PENNANT TEAMS'!$E$15,\"\")","v":0},{"$nulls":8},{"$f":"IF('PENNANT TEAMS'!$B$14=\"away\",'PENNANT TEAMS'!$E$16,\"\")","v":""}]
["Lead",null,{"$f":"IF('PENNANT TEAMS'!$B$14=\"home\",'PENNANT TEAMS'!$B$17,\"\")","v":""},{"$nulls":8},{"$f":"IF('PENNANT TEAMS'!$B$14=\"HOME\",'PENNANT TEAMS'!$B$18,\"\")","v":""},{"$nulls":4},"Lead",null,{"$f":"IF('PENNANT TEAMS'!$B$14=\"away\",'PENNANT TEAMS'!$B$17,\"\")","v":0},{"$nulls":8},{"$f":"IF('PENNANT TEAMS'!$B$14=\"away\",'PENNANT TEAMS'!$B$18,\"\")","v":""}]
["Second",null,{"$f":"IF('PENNANT TEAMS'!$B$14=\"home\",'PENNANT TEAMS'!$C$17,\"\")","v":""},{"$nulls":8},{"$f":"IF('PENNANT TEAMS'!$B$14=\"HOME\",'PENNANT TEAMS'!$C$18,\"\")","v":""},{"$nulls":4},"Second",null,{"$f":"IF('PENNANT TEAMS'!$B$14=\"away\",'PENNANT TEAMS'!$C$17,\"\")","v":0},{"$nulls":8},{"$f":"IF('PENNANT TEAMS'!$B$14=\"away\",'PENNANT TEAMS'!$C$18,\"\")","v":""}]
["Third",null,{"$f":"IF('PENNANT TEAMS'!$B$14=\"home\",'PENNANT TEAMS'!$D$17,\"\")","v":""},{"$nulls":8},{"$f":"IF('PENNANT TEAMS'!$B$14=\"HOME\",'PENNANT TEAMS'!$D$18,\"\")","v":""},{"$nulls":4},"Third",null,{"$f":"IF('PENNANT TEAMS'!$B$14=\"away\",'PENNANT TEAMS'!$D$17,\"\")","v":0},{"$nulls":8},{"$f":"IF('PENNANT TEAMS'!$B$14=\"away\",'PENNANT TEAMS'!$D$18,\"\")","v":""}]
["Skip",null,{"$f":"IF('PENNANT TEAMS'!$B$14=\"home\",'PENNANT TEAMS'!$E$17,\"\")","v":""},{"$nulls":8},{"$f":"IF('PENNANT TEAMS'!$B$14=\"HOME\",'PENNANT TEAMS'!$E$18,\"\")","v":""},{"$nulls":4},"Skip",null,{"$f":"IF('PENNANT TEAMS'!$B$14=\"away\",'PENNANT TEAMS'!$E$17,\"\")","v":0},{"$nulls":8},{"$f":"IF('PENNANT TEAMS'!$B$14=\"away\",'PENNANT TEAMS'!$E$18,\"\")","v":""}]
[{"$nulls":11},"TOTAL SCORE",{"$nulls":15},"TOTAL SCORE"]
[{"$nulls":11},"RINK WINS",{"$nulls":15},"RINK WINS"]
[{"$nulls":11},"POINTS TOTAL",{"$nulls":15},"POINTS TOTAL"]
["NAME OF WINNING CLUB"]
["Signature and Registration No. of Home Side Manager",{"$nulls":24},"POINT SCORING"]
["Signature and Registration No. of Visiting Side Manager",{"$nulls":24},"[Max Points = 5]"]
["PLEASE NOTE:",{"$nulls":3},"Only One (1) Return Sheet is provided for the Manager of the Home Side.",{"$nulls":21},"Match Win",null,null,"=",3]
[{"$nulls":4},"On completion of the Match, both Managers must fill in the Pennant Return and sign it.",{"$nulls":21},"Match Draw",null,null,"=","1½"]
[{"$nulls":4},"Also attach the two (2) cards from the Match Losing side shall be brought to next Delegates meeting"]
[{"$nulls":4},"The HOME SIDE then FAXES the Pennant Return to the District Chairman of Match:",{"$nulls":21},"Team Win",null,null,"=",1]
[{"$nulls":4},"Pattie Payne FAX NO. 43431621 immediatley after the game",{"$nulls":21},"Team Draw",null,null,"=","½"]
["CENTRAL COAST DISTRICT WOMEN'S BOWLING ASSOCIATION - PENNANT RETURN SHEET"]
["OFFICIAL SHEET 2019"]
["GRADE No.",null,null,{"$f":"'PENNANT TEAMS'!$A$22","v":3.1},null,"SECTION No.",{"$nulls":4},{"$f":"'PENNANT TEAMS'!$C$26","v":1},null,null,"ROUND No.",{"$nulls":3},{"$f":"'PENNANT TEAMS'!$B$5","v":2},null,"DATE OF MATCH",{"$nulls":6},{"$f":"'PENNANT TEAMS'!$B$4","v":"3rd March"},{"$f":"'PENNANT TEAMS'!$B$5","v":"1900-01-02"},{"$f":"'PENNANT TEAMS'!$B$5","v":"1900-01-02"},{"$f":"'PENNANT TEAMS'!$B$5","v":"1900-01-02"},{"$f":"'PENNANT TEAMS'!$B$5","v":"1900-01-02"},{"$f":"'PENNANT TEAMS'!$B$5","v":"1900-01-02"}]
[]
["HOME SIDE CLUB NAME:",null,null,{"$f":"IF('PENNANT TEAMS'!$B$21=\"Home\",'PENNANT TEAMS'!$C$3,IF('PENNANT TEAMS'!$B$21=\"away\",'PENNANT TEAMS'!$D$21,\"\"))","v":"Your club name here"},{"$nulls":8},"Side No.",null,{"$f":"IF('PENNANT TEAMS'!$B$21=\"home\",'PENNANT TEAMS'!$E$26,\"\")","v":1},null,"VISITING SIDE CLUB NAME:",null,null,{"$f":"IF('PENNANT TEAMS'!$B$21=\"Home\",'PENNANT TEAMS'!$D$21,IF('PENNANT TEAMS'!$B$21=\"away\",'PENNANT TEAMS'!$C$3,\"\"))","v":"Bateau Bay"},{"$nulls":8},"Side No.",null,{"$f":"IF('PENNANT TEAMS'!$B$21=\"away\",'PENNANT TEAMS'!$E$26,\"\")","v":""}]
["FULL NAMES OF PLAYERS TO BE PRINTED",{"$nulls":10},"REGISTRATION NUMBER",null,null,"SCORE",null,"FULL NAMES OF PLAYERS TO BE PRINTED",{"$nulls":10},"REGISTRATION NUMBER",null,null,"SCORE"]
["Lead",null,{"$f":"IF('PENNANT TEAMS'!$B$21=\"home\",'PENNANT TEAMS'!$B$22,\"\")","v":0},{"$nulls":8},{"$f":"IF('PENNANT TEAMS'!$B$21=\"HOME\",'PENNANT TEAMS'!$B$23,\"\")","v":""},{"$nulls":4},"Lead",null,{"$f":"IF('PENNANT TEAMS'!$B$21=\"away\",'PENNANT TEAMS'!$B$22,\"\")","v":""},{"$nulls":8},{"$f":"IF('PENNANT TEAMS'!$B$21=\"away\",'PENNANT TEAMS'!$B$23,\"\")","v":""}]
["Second",null,{"$f":"IF('PENNANT TEAMS'!$B$21=\"home\",'PENNANT TEAMS'!$C$22,\"\")","v":0},{"$nulls":8},{"$f":"IF('PENNANT TEAMS'!$B$21=\"HOME\",'PENNANT TEAMS'!$C$23,\"\")","v":""},{"$nulls":4},"Second",null,{"$f":"IF('PENNANT TEAMS'!$B$21=\"away\",'PENNANT TEAMS'!$C$22,\"\")","v":""},{"$nulls":8},{"$f":"IF('PENNANT TEAMS'!$B$21=\"away\",'PENNANT TEAMS'!$C$23,\"\")","v":""}]
["Third",null,{"$f":"IF('PENNANT TEAMS'!$B$21=\"home\",'PENNANT TEAMS'!$D$22,\"\")","v":0},{"$nulls":8},{"$f":"IF('PENNANT TEAMS'!$B$21=\"HOME\",'PENNANT TEAMS'!$D$23,\"\")","v":""},{"$nulls":4},"Third",null,{"$f":"IF('PENNANT TEAMS'!$B$21=\"away\",'PENNANT TEAMS'!$D$22,\"\")","v":""},{"$nulls":8},{"$f":"IF('PENNANT TEAMS'!$B$21=\"away\",'PENNANT TEAMS'!$D$23,\"\")","v":""}]
["Skip",null,{"$f":"IF('PENNANT TEAMS'!$B$21=\"home\",'PENNANT TEAMS'!$E$22,\"\")","v":0},{"$nulls":8},{"$f":"IF('PENNANT TEAMS'!$B$21=\"HOME\",'PENNANT TEAMS'!$E$23,\"\")","v":""},{"$nulls":4},"Skip",null,{"$f":"IF('PENNANT TEAMS'!$B$21=\"away\",'PENNANT TEAMS'!$E$22,\"\")","v":""},{"$nulls":8},{"$f":"IF('PENNANT TEAMS'!$B$21=\"away\",'PENNANT TEAMS'!$E$23,\"\")","v":""}]
["Lead",null,{"$f":"IF('PENNANT TEAMS'!$B$21=\"home\",'PENNANT TEAMS'!$B$24,\"\")","v":0},{"$nulls":8},{"$f":"IF('PENNANT TEAMS'!$B$21=\"HOME\",'PENNANT TEAMS'!$B$25,\"\")","v":""},{"$nulls":4},"Lead",null,{"$f":"IF('PENNANT TEAMS'!$B$21=\"away\",'PENNANT TEAMS'!$B$24,\"\")","v":""},{"$nulls":8},{"$f":"IF('PENNANT TEAMS'!$B$21=\"away\",'PENNANT TEAMS'!$B$25,\"\")","v":""}]
["Second",null,{"$f":"IF('PENNANT TEAMS'!$B$21=\"home\",'PENNANT TEAMS'!$C$24,\"\")","v":0},{"$nulls":8},{"$f":"IF('PENNANT TEAMS'!$B$21=\"HOME\",'PENNANT TEAMS'!$C$25,\"\")","v":""},{"$nulls":4},"Second",null,{"$f":"IF('PENNANT TEAMS'!$B$21=\"away\",'PENNANT TEAMS'!$C$24,\"\")","v":""},{"$nulls":8},{"$f":"IF('PENNANT TEAMS'!$B$21=\"away\",'PENNANT TEAMS'!$C$25,\"\")","v":""}]
["Third",null,{"$f":"IF('PENNANT TEAMS'!$B$21=\"home\",'PENNANT TEAMS'!$D$24,\"\")","v":0},{"$nulls":8},{"$f":"IF('PENNANT TEAMS'!$B$21=\"HOME\",'PENNANT TEAMS'!$D$25,\"\")","v":""},{"$nulls":4},"Third",null,{"$f":"IF('PENNANT TEAMS'!$B$21=\"away\",'PENNANT TEAMS'!$D$24,\"\")","v":""},{"$nulls":8},{"$f":"IF('PENNANT TEAMS'!$B$21=\"away\",'PENNANT TEAMS'!$D$25,\"\")","v":""}]
["Skip",null,{"$f":"IF('PENNANT TEAMS'!$B$21=\"home\",'PENNANT TEAMS'!$E$24,\"\")","v":0},{"$nulls":8},{"$f":"IF('PENNANT TEAMS'!$B$21=\"HOME\",'PENNANT TEAMS'!$E$25,\"\")","v":""},{"$nulls":4},"Skip",null,{"$f":"IF('PENNANT TEAMS'!$B$21=\"away\",'PENNANT TEAMS'!$E$24,\"\")","v":""},{"$nulls":8},{"$f":"IF('PENNANT TEAMS'!$B$21=\"away\",'PENNANT TEAMS'!$E$25,\"\")","v":""}]
[{"$nulls":11},"TOTAL SCORE",{"$nulls":15},"TOTAL SCORE"]
[{"$nulls":11},"RINK WINS",{"$nulls":15},"RINK WINS"]
[{"$nulls":11},"POINTS TOTAL",{"$nulls":15},"POINTS TOTAL"]
["NAME OF WINNING CLUB"]
["Signature and Registration No. of Home Side Manager",{"$nulls":24},"POINT SCORING"]
["Signature and Registration No. of Visiting Side Manager",{"$nulls":24},"[Max Points = 5]"]
["PLEASE NOTE:",{"$nulls":3},"Only One (1) Return Sheet is provided for the Manager of the Home Side.",{"$nulls":21},"Match Win",null,null,"=",3]
[{"$nulls":4},"On completion of the Match, both Managers must fill in the Pennant Return and sign it.",{"$nulls":21},"Match Draw",null,null,"=","1½"]
[{"$nulls":4},"Also attach the two (2) cards from the Match Losing side shall be brought to next Delegates meeting"]
[{"$nulls":4},"The HOME SIDE then FAXES the Pennant Return to the District Chairman of Match:",{"$nulls":21},"Team Win",null,null,"=",1]
[{"$nulls":4},"Pattie Payne FAX NO. 43431621 immediatley after the game",{"$nulls":21},"Team Draw",null,null,"=","½"]
["CENTRAL COAST DISTRICT WOMEN'S BOWLING ASSOCIATION - PENNANT RETURN SHEET"]
["OFFICIAL SHEET 2019"]
["GRADE No.",null,null,{"$f":"'PENNANT TEAMS'!$A$29","v":3.2},null,"SECTION No.",{"$nulls":4},{"$f":"'PENNANT TEAMS'!$C$33","v":2},null,null,"ROUND No.",{"$nulls":3},{"$f":"'PENNANT TEAMS'!$B$5","v":2},null,"DATE OF MATCH",{"$nulls":6},{"$f":"'PENNANT TEAMS'!$B$4","v":"3rd March"},{"$f":"'PENNANT TEAMS'!$B$5","v":"1900-01-02"},{"$f":"'PENNANT TEAMS'!$B$5","v":"1900-01-02"},{"$f":"'PENNANT TEAMS'!$B$5","v":"1900-01-02"},{"$f":"'PENNANT TEAMS'!$B$5","v":"1900-01-02"},{"$f":"'PENNANT TEAMS'!$B$5","v":"1900-01-02"}]
[]
["HOME SIDE CLUB NAME:",null,null,{"$f":"IF('PENNANT TEAMS'!$B$28=\"Home\",'PENNANT TEAMS'!$C$3,IF('PENNANT TEAMS'!$B$28=\"away\",'PENNANT TEAMS'!$D$28,\"\"))","v":"Wyong"},{"$nulls":8},"Side No.",null,{"$f":"IF('PENNANT TEAMS'!$B$28=\"home\",'PENNANT TEAMS'!$E$33,\"\")","v":""},null,"VISITING SIDE CLUB NAME:",null,null,{"$f":"IF('PENNANT TEAMS'!$B$28=\"Home\",'PENNANT TEAMS'!$D$28,IF('PENNANT TEAMS'!$B$28=\"away\",'PENNANT TEAMS'!$C$3,\"\"))","v":"Your club name here"},{"$nulls":8},"Side No.",null,{"$f":"IF('PENNANT TEAMS'!$B$28=\"away\",'PENNANT TEAMS'!$E$33,\"\")","v":2}]
["FULL NAMES OF PLAYERS TO BE PRINTED",{"$nulls":10},"REGISTRATION NUMBER",null,null,"SCORE",null,"FULL NAMES OF PLAYERS TO BE PRINTED",{"$nulls":10},"REGISTRATION NUMBER",null,null,"SCORE"]
["Lead",null,{"$f":"IF('PENNANT TEAMS'!$B$28=\"home\",'PENNANT TEAMS'!$B$29,\"\")","v":""},{"$nulls":8},{"$f":"IF('PENNANT TEAMS'!$B$28=\"HOME\",'PENNANT TEAMS'!$B$30,\"\")","v":""},{"$nulls":4},"Lead",null,{"$f":"IF('PENNANT TEAMS'!$B$28=\"away\",'PENNANT TEAMS'!$B$29,\"\")","v":0},{"$nulls":8},{"$f":"IF('PENNANT TEAMS'!$B$28=\"away\",'PENNANT TEAMS'!$B$30,\"\")","v":""}]
["Second",null,{"$f":"IF('PENNANT TEAMS'!$B$28=\"home\",'PENNANT TEAMS'!$C$29,\"\")","v":""},{"$nulls":8},{"$f":"IF('PENNANT TEAMS'!$B$28=\"HOME\",'PENNANT TEAMS'!$C$30,\"\")","v":""},{"$nulls":4},"Second",null,{"$f":"IF('PENNANT TEAMS'!$B$28=\"away\",'PENNANT TEAMS'!$C$29,\"\")","v":0},{"$nulls":8},{"$f":"IF('PENNANT TEAMS'!$B$28=\"away\",'PENNANT TEAMS'!$C$30,\"\")","v":""}]
["Third",null,{"$f":"IF('PENNANT TEAMS'!$B$28=\"home\",'PENNANT TEAMS'!$D$29,\"\")","v":""},{"$nulls":8},{"$f":"IF('PENNANT TEAMS'!$B$28=\"HOME\",'PENNANT TEAMS'!$D$30,\"\")","v":""},{"$nulls":4},"Third",null,{"$f":"IF('PENNANT TEAMS'!$B$28=\"away\",'PENNANT TEAMS'!$D$29,\"\")","v":0},{"$nulls":8},{"$f":"IF('PENNANT TEAMS'!$B$28=\"away\",'PENNANT TEAMS'!$D$30,\"\")","v":""}]
["Skip",null,{"$f":"IF('PENNANT TEAMS'!$B$28=\"home\",'PENNANT TEAMS'!$E$29,\"\")","v":""},{"$nulls":8},{"$f":"IF('PENNANT TEAMS'!$B$28=\"HOME\",'PENNANT TEAMS'!$E$30,\"\")","v":""},{"$nulls":4},"Skip",null,{"$f":"IF('PENNANT TEAMS'!$B$28=\"away\",'PENNANT TEAMS'!$E$29,\"\")","v":0},{"$nulls":8},{"$f":"IF('PENNANT TEAMS'!$B$28=\"away\",'PENNANT TEAMS'!$E$30,\"\")","v":""}]
["Lead",null,{"$f":"IF('PENNANT TEAMS'!$B$28=\"home\",'PENNANT TEAMS'!$B$31,\"\")","v":""},{"$nulls":8},{"$f":"IF('PENNANT TEAMS'!$B$28=\"HOME\",'PENNANT TEAMS'!$B$32,\"\")","v":""},{"$nulls":4},"Lead",null,{"$f":"IF('PENNANT TEAMS'!$B$28=\"away\",'PENNANT TEAMS'!$B$31,\"\")","v":0},{"$nulls":8},{"$f":"IF('PENNANT TEAMS'!$B$28=\"away\",'PENNANT TEAMS'!$B$32,\"\")","v":""}]
["Second",null,{"$f":"IF('PENNANT TEAMS'!$B$28=\"home\",'PENNANT TEAMS'!$C$31,\"\")","v":""},{"$nulls":8},{"$f":"IF('PENNANT TEAMS'!$B$28=\"HOME\",'PENNANT TEAMS'!$C$32,\"\")","v":""},{"$nulls":4},"Second",null,{"$f":"IF('PENNANT TEAMS'!$B$28=\"away\",'PENNANT TEAMS'!$C$31,\"\")","v":0},{"$nulls":8},{"$f":"IF('PENNANT TEAMS'!$B$28=\"away\",'PENNANT TEAMS'!$C$32,\"\")","v":""}]
["Third",null,{"$f":"IF('PENNANT TEAMS'!$B$28=\"home\",'PENNANT TEAMS'!$D$31,\"\")","v":""},{"$nulls":8},{"$f":"IF('PENNANT TEAMS'!$B$28=\"HOME\",'PENNANT TEAMS'!$D$32,\"\")","v":""},{"$nulls":4},"Third",null,{"$f":"IF('PENNANT TEAMS'!$B$28=\"away\",'PENNANT TEAMS'!$D$31,\"\")","v":0},{"$nulls":8},{"$f":"IF('PENNANT TEAMS'!$B$28=\"away\",'PENNANT TEAMS'!$D$32,\"\")","v":""}]
["Skip",null,{"$f":"IF('PENNANT TEAMS'!$B$28=\"home\",'PENNANT TEAMS'!$E$31,\"\")","v":""},{"$nulls":8},{"$f":"IF('PENNANT TEAMS'!$B$28=\"HOME\",'PENNANT TEAMS'!$E$32,\"\")","v":""},{"$nulls":4},"Skip",null,{"$f":"IF('PENNANT TEAMS'!$B$28=\"away\",'PENNANT TEAMS'!$E$31,\"\")","v":0},{"$nulls":8},{"$f":"IF('PENNANT TEAMS'!$B$28=\"away\",'PENNANT TEAMS'!$E$32,\"\")","v":""}]
[{"$nulls":11},"TOTAL SCORE",{"$nulls":15},"TOTAL SCORE"]
[{"$nulls":11},"RINK WINS",{"$nulls":15},"RINK WINS"]
[{"$nulls":11},"POINTS TOTAL",{"$nulls":15},"POINTS TOTAL"]
["NAME OF WINNING CLUB"]
["Signature and Registration No. of Home Side Manager",{"$nulls":24},"POINT SCORING"]
["Signature and Registration No. of Visiting Side Manager",{"$nulls":24},"[Max Points = 5]"]
["PLEASE NOTE:",{"$nulls":3},"Only One (1) Return Sheet is provided for the Manager of the Home Side.",{"$nulls":21},"Match Win",null,null,"=",3]
[{"$nulls":4},"On completion of the Match, both Managers must fill in the Pennant Return and sign it.",{"$nulls":21},"Match Draw",null,null,"=","1½"]
[{"$nulls":4},"Also attach the two (2) cards from the Match Losing side shall be brought to next Delegates meeting"]
[{"$nulls":4},"The HOME SIDE then FAXES the Pennant Return to the District Chairman of Match:",{"$nulls":21},"Team Win",null,null,"=",1]
[{"$nulls":4},"Pattie Payne FAX NO. 43431621 immediatley after the game",{"$nulls":21},"Team Draw",null,null,"=","½"]
["CENTRAL COAST DISTRICT WOMEN'S BOWLING ASSOCIATION - PENNANT RETURN SHEET"]
["OFFICIAL SHEET 2019"]
["GRADE No.",null,null,{"$f":"'PENNANT TEAMS'!$A$36","v":4.1},null,"SECTION No.",{"$nulls":4},{"$f":"'PENNANT TEAMS'!$C$40","v":1},null,null,"ROUND No.",{"$nulls":3},{"$f":"'PENNANT TEAMS'!$B$5","v":2},null,"DATE OF MATCH",{"$nulls":6},{"$f":"'PENNANT TEAMS'!$B$4","v":"3rd March"},{"$f":"'PENNANT TEAMS'!$B$5","v":"1900-01-02"},{"$f":"'PENNANT TEAMS'!$B$5","v":"1900-01-02"},{"$f":"'PENNANT TEAMS'!$B$5","v":"1900-01-02"},{"$f":"'PENNANT TEAMS'!$B$5","v":"1900-01-02"},{"$f":"'PENNANT TEAMS'!$B$5","v":"1900-01-02"}]
[]
["HOME SIDE CLUB NAME:",null,null,{"$f":"IF('PENNANT TEAMS'!$B$35=\"Home\",'PENNANT TEAMS'!$C$3,IF('PENNANT TEAMS'!$B$35=\"away\",'PENNANT TEAMS'!$D$35,\"\"))","v":"Davistown"},{"$nulls":8},"Side No.",null,{"$f":"IF('PENNANT TEAMS'!$B$35=\"home\",'PENNANT TEAMS'!$E$40,\"\")","v":""},null,"VISITING SIDE CLUB NAME:",null,null,{"$f":"IF('PENNANT TEAMS'!$B$35=\"Home\",'PENNANT TEAMS'!$D$35,IF('PENNANT TEAMS'!$B$35=\"away\",'PENNANT TEAMS'!$C$3,\"\"))","v":"Your club name here"},{"$nulls":8},"Side No.",null,{"$f":"IF('PENNANT TEAMS'!$B$35=\"away\",'PENNANT TEAMS'!$E$40,\"\")","v":1}]
["FULL NAMES OF PLAYERS TO BE PRINTED",{"$nulls":10},"REGISTRATION NUMBER",null,null,"SCORE",null,"FULL NAMES OF PLAYERS TO BE PRINTED",{"$nulls":10},"REGISTRATION NUMBER",null,null,"SCORE"]
["Lead",null,{"$f":"IF('PENNANT TEAMS'!$B$35=\"home\",'PENNANT TEAMS'!$B$36,\"\")","v":""},{"$nulls":8},{"$f":"IF('PENNANT TEAMS'!$B$35=\"HOME\",'PENNANT TEAMS'!$B$37,\"\")","v":""},{"$nulls":4},"Lead",null,{"$f":"IF('PENNANT TEAMS'!$B$35=\"away\",'PENNANT TEAMS'!$B$36,\"\")","v":0},{"$nulls":8},{"$f":"IF('PENNANT TEAMS'!$B$35=\"away\",'PENNANT TEAMS'!$B$37,\"\")","v":""}]
["Second",null,{"$f":"IF('PENNANT TEAMS'!$B$35=\"home\",'PENNANT TEAMS'!$C$36,\"\")","v":""},{"$nulls":8},{"$f":"IF('PENNANT TEAMS'!$B$35=\"HOME\",'PENNANT TEAMS'!$C$37,\"\")","v":""},{"$nulls":4},"Second",null,{"$f":"IF('PENNANT TEAMS'!$B$35=\"away\",'PENNANT TEAMS'!$C$36,\"\")","v":0},{"$nulls":8},{"$f":"IF('PENNANT TEAMS'!$B$35=\"away\",'PENNANT TEAMS'!$C$37,\"\")","v":""}]
["Third",null,{"$f":"IF('PENNANT TEAMS'!$B$35=\"home\",'PENNANT TEAMS'!$D$36,\"\")","v":""},{"$nulls":8},{"$f":"IF('PENNANT TEAMS'!$B$35=\"HOME\",'PENNANT TEAMS'!$D$37,\"\")","v":""},{"$nulls":4},"Third",null,{"$f":"IF('PENNANT TEAMS'!$B$35=\"away\",'PENNANT TEAMS'!$D$36,\"\")","v":0},{"$nulls":8},{"$f":"IF('PENNANT TEAMS'!$B$35=\"away\",'PENNANT TEAMS'!$D$37,\"\")","v":""}]
["Skip",null,{"$f":"IF('PENNANT TEAMS'!$B$35=\"home\",'PENNANT TEAMS'!$E$36,\"\")","v":""},{"$nulls":8},{"$f":"IF('PENNANT TEAMS'!$B$35=\"HOME\",'PENNANT TEAMS'!$E$37,\"\")","v":""},{"$nulls":4},"Skip",null,{"$f":"IF('PENNANT TEAMS'!$B$35=\"away\",'PENNANT TEAMS'!$E$36,\"\")","v":0},{"$nulls":8},{"$f":"IF('PENNANT TEAMS'!$B$35=\"away\",'PENNANT TEAMS'!$E$37,\"\")","v":""}]
["Lead",null,{"$f":"IF('PENNANT TEAMS'!$B$35=\"home\",'PENNANT TEAMS'!$B$38,\"\")","v":""},{"$nulls":8},{"$f":"IF('PENNANT TEAMS'!$B$35=\"HOME\",'PENNANT TEAMS'!$B$39,\"\")","v":""},{"$nulls":4},"Lead",null,{"$f":"IF('PENNANT TEAMS'!$B$35=\"away\",'PENNANT TEAMS'!$B$38,\"\")","v":0},{"$nulls":8},{"$f":"IF('PENNANT TEAMS'!$B$35=\"away\",'PENNANT TEAMS'!$B$39,\"\")","v":""}]
["Second",null,{"$f":"IF('PENNANT TEAMS'!$B$35=\"home\",'PENNANT TEAMS'!$C$38,\"\")","v":""},{"$nulls":8},{"$f":"IF('PENNANT TEAMS'!$B$35=\"HOME\",'PENNANT TEAMS'!$C$39,\"\")","v":""},{"$nulls":4},"Second",null,{"$f":"IF('PENNANT TEAMS'!$B$35=\"away\",'PENNANT TEAMS'!$C$38,\"\")","v":0},{"$nulls":8},{"$f":"IF('PENNANT TEAMS'!$B$35=\"away\",'PENNANT TEAMS'!$C$39,\"\")","v":""}]
["Third",null,{"$f":"IF('PENNANT TEAMS'!$B$35=\"home\",'PENNANT TEAMS'!$D$38,\"\")","v":""},{"$nulls":8},{"$f":"IF('PENNANT TEAMS'!$B$35=\"HOME\",'PENNANT TEAMS'!$D$39,\"\")","v":""},{"$nulls":4},"Third",null,{"$f":"IF('PENNANT TEAMS'!$B$35=\"away\",'PENNANT TEAMS'!$D$38,\"\")","v":0},{"$nulls":8},{"$f":"IF('PENNANT TEAMS'!$B$35=\"away\",'PENNANT TEAMS'!$D$39,\"\")","v":""}]
["Skip",null,{"$f":"IF('PENNANT TEAMS'!$B$35=\"home\",'PENNANT TEAMS'!$E$38,\"\")","v":""},{"$nulls":8},{"$f":"IF('PENNANT TEAMS'!$B$35=\"HOME\",'PENNANT TEAMS'!$E$39,\"\")","v":""},{"$nulls":4},"Skip",null,{"$f":"IF('PENNANT TEAMS'!$B$35=\"away\",'PENNANT TEAMS'!$E$38,\"\")","v":0},{"$nulls":8},{"$f":"IF('PENNANT TEAMS'!$B$35=\"away\",'PENNANT TEAMS'!$E$39,\"\")","v":""}]
[{"$nulls":11},"TOTAL SCORE",{"$nulls":15},"TOTAL SCORE"]
[{"$nulls":11},"RINK WINS",{"$nulls":15},"RINK WINS"]
[{"$nulls":11},"POINTS TOTAL",{"$nulls":15},"POINTS TOTAL"]
["NAME OF WINNING CLUB"]
["Signature and Registration No. of Home Side Manager",{"$nulls":24},"POINT SCORING"]
["Signature and Registration No. of Visiting Side Manager",{"$nulls":24},"[Max Points = 5]"]
["PLEASE NOTE:",{"$nulls":3},"Only One (1) Return Sheet is provided for the Manager of the Home Side.",{"$nulls":21},"Match Win",null,null,"=",3]
[{"$nulls":4},"On completion of the Match, both Managers must fill in the Pennant Return and sign it.",{"$nulls":21},"Match Draw",null,null,"=","1½"]
[{"$nulls":4},"Also attach the two (2) cards from the Match Losing side shall be brought to nest Delegates meeting"]
[{"$nulls":4},"The HOME SIDE then FAXES the Pennant Return to the District Chairman of Match:",{"$nulls":21},"Team Win",null,null,"=",1]
[{"$nulls":4},"Pattie Payne FAX NO. 43431621 immediatley after the game",{"$nulls":21},"Team Draw",null,null,"=","½"]
["CENTRAL COAST DISTRICT WOMEN'S BOWLING ASSOCIATION - PENNANT RETURN SHEET"]
["OFFICIAL SHEET 2019"]
["GRADE No.",null,null,{"$f":"'PENNANT TEAMS'!$A$43","v":4.2},null,"SECTION No.",{"$nulls":4},{"$f":"'PENNANT TEAMS'!$C$47","v":2},null,null,"ROUND No.",{"$nulls":3},{"$f":"'PENNANT TEAMS'!$B$5","v":2},null,"DATE OF MATCH",{"$nulls":6},{"$f":"'PENNANT TEAMS'!$B$4","v":"3rd March"},{"$f":"'PENNANT TEAMS'!$B$5","v":"1900-01-02"},{"$f":"'PENNANT TEAMS'!$B$5","v":"1900-01-02"},{"$f":"'PENNANT TEAMS'!$B$5","v":"1900-01-02"},{"$f":"'PENNANT TEAMS'!$B$5","v":"1900-01-02"},{"$f":"'PENNANT TEAMS'!$B$5","v":"1900-01-02"}]
[]
["HOME SIDE CLUB NAME:",null,null,{"$f":"IF('PENNANT TEAMS'!$B$42=\"Home\",'PENNANT TEAMS'!$C$3,IF('PENNANT TEAMS'!$B$42=\"away\",'PENNANT TEAMS'!$D$42,\"\"))","v":"Terrigal"},{"$nulls":8},"Side No.",null,{"$f":"IF('PENNANT TEAMS'!$B$42=\"home\",'PENNANT TEAMS'!$E$47,\"\")","v":""},null,"VISITING SIDE CLUB NAME:",null,null,{"$f":"IF('PENNANT TEAMS'!$B$42=\"Home\",'PENNANT TEAMS'!$D$42,IF('PENNANT TEAMS'!$B$42=\"away\",'PENNANT TEAMS'!$C$3,\"\"))","v":"Your club name here"},{"$nulls":8},"Side No.",null,{"$f":"IF('PENNANT TEAMS'!$B$42=\"away\",'PENNANT TEAMS'!$E$47,\"\")","v":0}]
["FULL NAMES OF PLAYERS TO BE PRINTED",{"$nulls":10},"REGISTRATION NUMBER",null,null,"SCORE",null,"FULL NAMES OF PLAYERS TO BE PRINTED",{"$nulls":10},"REGISTRATION NUMBER",null,null,"SCORE"]
["Lead",null,{"$f":"IF('PENNANT TEAMS'!$B$42=\"home\",'PENNANT TEAMS'!$B$43,\"\")","v":""},{"$nulls":8},{"$f":"IF('PENNANT TEAMS'!$B$42=\"HOME\",'PENNANT TEAMS'!$B$44,\"\")","v":""},{"$nulls":4},"Lead",null,{"$f":"IF('PENNANT TEAMS'!$B$42=\"away\",'PENNANT TEAMS'!$B$43,\"\")","v":0},{"$nulls":8},{"$f":"IF('PENNANT TEAMS'!$B$42=\"away\",'PENNANT TEAMS'!$B$44,\"\")","v":""}]
["Second",null,{"$f":"IF('PENNANT TEAMS'!$B$42=\"home\",'PENNANT TEAMS'!$C$43,\"\")","v":""},{"$nulls":8},{"$f":"IF('PENNANT TEAMS'!$B$42=\"HOME\",'PENNANT TEAMS'!$C$44,\"\")","v":""},{"$nulls":4},"Second",null,{"$f":"IF('PENNANT TEAMS'!$B$42=\"away\",'PENNANT TEAMS'!$C$43,\"\")","v":0},{"$nulls":8},{"$f":"IF('PENNANT TEAMS'!$B$42=\"away\",'PENNANT TEAMS'!$C$44,\"\")","v":""}]
["Third",null,{"$f":"IF('PENNANT TEAMS'!$B$42=\"home\",'PENNANT TEAMS'!$D$43,\"\")","v":""},{"$nulls":8},{"$f":"IF('PENNANT TEAMS'!$B$42=\"HOME\",'PENNANT TEAMS'!$D$44,\"\")","v":""},{"$nulls":4},"Third",null,{"$f":"IF('PENNANT TEAMS'!$B$42=\"away\",'PENNANT TEAMS'!$D$43,\"\")","v":0},{"$nulls":8},{"$f":"IF('PENNANT TEAMS'!$B$42=\"away\",'PENNANT TEAMS'!$D$44,\"\")","v":""}]
["Skip",null,{"$f":"IF('PENNANT TEAMS'!$B$42=\"home\",'PENNANT TEAMS'!$E$43,\"\")","v":""},{"$nulls":8},{"$f":"IF('PENNANT TEAMS'!$B$42=\"HOME\",'PENNANT TEAMS'!$E$44,\"\")","v":""},{"$nulls":4},"Skip",null,{"$f":"IF('PENNANT TEAMS'!$B$42=\"away\",'PENNANT TEAMS'!$E$43,\"\")","v":0},{"$nulls":8},{"$f":"IF('PENNANT TEAMS'!$B$42=\"away\",'PENNANT TEAMS'!$E$44,\"\")","v":""}]
["Lead",null,{"$f":"IF('PENNANT TEAMS'!$B$42=\"home\",'PENNANT TEAMS'!$B$45,\"\")","v":""},{"$nulls":8},{"$f":"IF('PENNANT TEAMS'!$B$42=\"HOME\",'PENNANT TEAMS'!$B$46,\"\")","v":""},{"$nulls":4},"Lead",null,{"$f":"IF('PENNANT TEAMS'!$B$42=\"away\",'PENNANT TEAMS'!$B$45,\"\")","v":0},{"$nulls":8},{"$f":"IF('PENNANT TEAMS'!$B$42=\"away\",'PENNANT TEAMS'!$B$46,\"\")","v":""}]
["Second",null,{"$f":"IF('PENNANT TEAMS'!$B$42=\"home\",'PENNANT TEAMS'!$C$45,\"\")","v":""},{"$nulls":8},{"$f":"IF('PENNANT TEAMS'!$B$42=\"HOME\",'PENNANT TEAMS'!$C$46,\"\")","v":""},{"$nulls":4},"Second",null,{"$f":"IF('PENNANT TEAMS'!$B$42=\"away\",'PENNANT TEAMS'!$C$45,\"\")","v":0},{"$nulls":8},{"$f":"IF('PENNANT TEAMS'!$B$42=\"away\",'PENNANT TEAMS'!$C$46,\"\")","v":""}]
["Third",null,{"$f":"IF('PENNANT TEAMS'!$B$42=\"home\",'PENNANT TEAMS'!$D$45,\"\")","v":""},{"$nulls":8},{"$f":"IF('PENNANT TEAMS'!$B$42=\"HOME\",'PENNANT TEAMS'!$D$46,\"\")","v":""},{"$nulls":4},"Third",null,{"$f":"IF('PENNANT TEAMS'!$B$42=\"away\",'PENNANT TEAMS'!$D$45,\"\")","v":0},{"$nulls":8},{"$f":"IF('PENNANT TEAMS'!$B$42=\"away\",'PENNANT TEAMS'!$D$46,\"\")","v":""}]
["Skip",null,{"$f":"IF('PENNANT TEAMS'!$B$42=\"home\",'PENNANT TEAMS'!$E$45,\"\")","v":""},{"$nulls":8},{"$f":"IF('PENNANT TEAMS'!$B$42=\"HOME\",'PENNANT TEAMS'!$E$46,\"\")","v":""},{"$nulls":4},"Skip",null,{"$f":"IF('PENNANT TEAMS'!$B$42=\"away\",'PENNANT TEAMS'!$E$45,\"\")","v":0},{"$nulls":8},{"$f":"IF('PENNANT TEAMS'!$B$42=\"away\",'PENNANT TEAMS'!$E$46,\"\")","v":""}]
[{"$nulls":11},"TOTAL SCORE",{"$nulls":15},"TOTAL SCORE"]
[{"$nulls":11},"RINK WINS",{"$nulls":15},"RINK WINS"]
[{"$nulls":11},"POINTS TOTAL",{"$nulls":15},"POINTS TOTAL"]
["NAME OF WINNING CLUB"]
["Signature and Registration No. of Home Side Manager",{"$nulls":24},"POINT SCORING"]
["Signature and Registration No. of Visiting Side Manager",{"$nulls":24},"[Max Points = 5]"]
["PLEASE NOTE:",{"$nulls":3},"Only One (1) Return Sheet is provided for the Manager of the Home Side.",{"$nulls":21},"Match Win",null,null,"=",3]
[{"$nulls":4},"On completion of the Match, both Managers must fill in the Pennant Return and sign it.",{"$nulls":21},"Match Draw",null,null,"=","1½"]
[{"$nulls":4},"Also attach the two (2) cards from the Match Losing side shall be brought to next Delegates meeting"]
[{"$nulls":4},"The HOME SIDE then FAXES the Pennant Return to the District Chairman of Match:",{"$nulls":21},"Team Win",null,null,"=",1]
[{"$nulls":4},"Pattie Payne FAX NO. 43431621 immediatley after the game",{"$nulls":21},"Team Draw",null,null,"=","½"]
["CENTRAL COAST DISTRICT WOMEN'S BOWLING ASSOCIATION - PENNANT RETURN SHEET"]
[]
["GRADE No.",null,null,{"$f":"'PENNANT TEAMS'!$A$50","v":7},null,"SECTION No.",{"$nulls":4},{"$f":"'PENNANT TEAMS'!$C$54","v":7},null,null,"ROUND No.",{"$nulls":3},{"$f":"'PENNANT TEAMS'!$B$5","v":2},null,"DATE OF MATCH",{"$nulls":6},{"$f":"'PENNANT TEAMS'!$B$4","v":"3rd March"},{"$f":"'PENNANT TEAMS'!$B$5","v":"1900-01-02"},{"$f":"'PENNANT TEAMS'!$B$5","v":"1900-01-02"},{"$f":"'PENNANT TEAMS'!$B$5","v":"1900-01-02"},{"$f":"'PENNANT TEAMS'!$B$5","v":"1900-01-02"},{"$f":"'PENNANT TEAMS'!$B$5","v":"1900-01-02"}]
[]
["HOME SIDE CLUB NAME:",null,null,{"$f":"IF('PENNANT TEAMS'!$B$49=\"Home\",'PENNANT TEAMS'!$C$3,IF('PENNANT TEAMS'!$B$49=\"away\",'PENNANT TEAMS'!$D$49,\"\"))","v":"TEAM7"},{"$nulls":8},"Side No.",null,{"$f":"IF('PENNANT TEAMS'!$B$49=\"home\",'PENNANT TEAMS'!$E$54,\"\")","v":""},null,"VISITING SIDE CLUB NAME:",null,null,{"$f":"IF('PENNANT TEAMS'!$B$49=\"Home\",'PENNANT TEAMS'!$D$49,IF('PENNANT TEAMS'!$B$49=\"away\",'PENNANT TEAMS'!$C$3,\"\"))","v":"Your club name here"},{"$nulls":8},"Side No.",null,{"$f":"IF('PENNANT TEAMS'!$B$49=\"away\",'PENNANT TEAMS'!$E$54,\"\")","v":7}]
["FULL NAMES OF PLAYERS TO BE PRINTED",{"$nulls":10},"REGISTRATION NUMBER",null,null,"SCORE",null,"FULL NAMES OF PLAYERS TO BE PRINTED",{"$nulls":10},"REGISTRATION NUMBER",null,null,"SCORE"]
["Lead",null,{"$f":"IF('PENNANT TEAMS'!$B$49=\"home\",'PENNANT TEAMS'!$B$50,\"\")","v":""},{"$nulls":8},{"$f":"IF('PENNANT TEAMS'!$B$49=\"HOME\",'PENNANT TEAMS'!$B$51,\"\")","v":""},{"$nulls":4},"Lead",null,{"$f":"IF('PENNANT TEAMS'!$B$49=\"away\",'PENNANT TEAMS'!$B$50,\"\")","v":0},{"$nulls":8},{"$f":"IF('PENNANT TEAMS'!$B$49=\"away\",'PENNANT TEAMS'!$B$51,\"\")","v":""}]
["Second",null,{"$f":"IF('PENNANT TEAMS'!$B$49=\"home\",'PENNANT TEAMS'!$C$50,\"\")","v":""},{"$nulls":8},{"$f":"IF('PENNANT TEAMS'!$B$49=\"HOME\",'PENNANT TEAMS'!$C$51,\"\")","v":""},{"$nulls":4},"Second",null,{"$f":"IF('PENNANT TEAMS'!$B$49=\"away\",'PENNANT TEAMS'!$C$50,\"\")","v":0},{"$nulls":8},{"$f":"IF('PENNANT TEAMS'!$B$49=\"away\",'PENNANT TEAMS'!$C$51,\"\")","v":""}]
["Third",null,{"$f":"IF('PENNANT TEAMS'!$B$49=\"home\",'PENNANT TEAMS'!$D$50,\"\")","v":""},{"$nulls":8},{"$f":"IF('PENNANT TEAMS'!$B$49=\"HOME\",'PENNANT TEAMS'!$D51,\"\")","v":""},{"$nulls":4},"Third",null,{"$f":"IF('PENNANT TEAMS'!$B$49=\"away\",'PENNANT TEAMS'!$D$50,\"\")","v":0},{"$nulls":8},{"$f":"IF('PENNANT TEAMS'!$B$49=\"away\",'PENNANT TEAMS'!$D51,\"\")","v":""}]
["Skip",null,{"$f":"IF('PENNANT TEAMS'!$B$49=\"home\",'PENNANT TEAMS'!$E$50,\"\")","v":""},{"$nulls":8},{"$f":"IF('PENNANT TEAMS'!$B$49=\"HOME\",'PENNANT TEAMS'!$E$51,\"\")","v":""},{"$nulls":4},"Skip",null,{"$f":"IF('PENNANT TEAMS'!$B$49=\"away\",'PENNANT TEAMS'!$E$50,\"\")","v":0},{"$nulls":8},{"$f":"IF('PENNANT TEAMS'!$B$49=\"away\",'PENNANT TEAMS'!$E$51,\"\")","v":""}]
["Lead",null,{"$f":"IF('PENNANT TEAMS'!$B$49=\"home\",'PENNANT TEAMS'!$B$52,\"\")","v":""},{"$nulls":8},{"$f":"IF('PENNANT TEAMS'!$B$49=\"HOME\",'PENNANT TEAMS'!$B$53,\"\")","v":""},{"$nulls":4},"Lead",null,{"$f":"IF('PENNANT TEAMS'!$B$49=\"away\",'PENNANT TEAMS'!$B$52,\"\")","v":0},{"$nulls":8},{"$f":"IF('PENNANT TEAMS'!$B$49=\"away\",'PENNANT TEAMS'!$B$53,\"\")","v":""}]
["Second",null,{"$f":"IF('PENNANT TEAMS'!$B$49=\"home\",'PENNANT TEAMS'!$C$52,\"\")","v":""},{"$nulls":8},{"$f":"IF('PENNANT TEAMS'!$B$49=\"HOME\",'PENNANT TEAMS'!$C$53,\"\")","v":""},{"$nulls":4},"Second",null,{"$f":"IF('PENNANT TEAMS'!$B$49=\"away\",'PENNANT TEAMS'!$C$52,\"\")","v":0},{"$nulls":8},{"$f":"IF('PENNANT TEAMS'!$B$49=\"away\",'PENNANT TEAMS'!$C$53,\"\")","v":""}]
["Third",null,{"$f":"IF('PENNANT TEAMS'!$B$49=\"home\",'PENNANT TEAMS'!$D$52,\"\")","v":""},{"$nulls":8},{"$f":"IF('PENNANT TEAMS'!$B$49=\"HOME\",'PENNANT TEAMS'!$D$53,\"\")","v":""},{"$nulls":4},"Third",null,{"$f":"IF('PENNANT TEAMS'!$B$49=\"away\",'PENNANT TEAMS'!$D$52,\"\")","v":0},{"$nulls":8},{"$f":"IF('PENNANT TEAMS'!$B$49=\"away\",'PENNANT TEAMS'!$D$53,\"\")","v":""}]
["Skip",null,{"$f":"IF('PENNANT TEAMS'!$B$49=\"home\",'PENNANT TEAMS'!$E$52,\"\")","v":""},{"$nulls":8},{"$f":"IF('PENNANT TEAMS'!$B$49=\"HOME\",'PENNANT TEAMS'!$E$53,\"\")","v":""},{"$nulls":4},"Skip",null,{"$f":"IF('PENNANT TEAMS'!$B$49=\"away\",'PENNANT TEAMS'!$E$52,\"\")","v":0},{"$nulls":8},{"$f":"IF('PENNANT TEAMS'!$B$49=\"away\",'PENNANT TEAMS'!$E$53,\"\")","v":""}]
[{"$nulls":11},"TOTAL SCORE",{"$nulls":15},"TOTAL SCORE"]
[{"$nulls":11},"RINK WINS",{"$nulls":15},"RINK WINS"]
[{"$nulls":11},"POINTS TOTAL",{"$nulls":15},"POINTS TOTAL"]
["NAME OF WINNING CLUB"]
["Signature and Registration No. of Home Side Manager",{"$nulls":23},"POINT SCORING"]
["Signature and Registration No. of Visiting Side Manager",{"$nulls":23},"[Max Points = 5]"]
["PLEASE NOTE:",{"$nulls":3},"Only One (1) Return Sheet is provided for the Manager of the Home Side.",{"$nulls":20},"Match Win",null,null,"=",3]
[{"$nulls":4},"On completion of the Match, both Managers must fill in the Pennant Return and sign it.",{"$nulls":20},"Match Draw",null,null,"=","1½"]
[{"$nulls":4},"The Home Side then posts the Pennant Return to the District Chairman of Match:",{"$nulls":20},"Team Win",null,null,"=",1]
[{"$nulls":4}," Pattie Payne, 55 Hobart Avenue, UMINA BEACH. 2257",{"$nulls":20},"Team Draw",null,null,"=","½"]
["CENTRAL COAST DISTRICT WOMEN'S BOWLING ASSOCIATION - PENNANT RETURN SHEET"]
[]
["GRADE No.",null,null,{"$f":"'PENNANT TEAMS'!$A$57","v":8},null,"SECTION No.",{"$nulls":4},{"$f":"'PENNANT TEAMS'!$C$61","v":8},null,null,"ROUND No.",{"$nulls":3},{"$f":"'PENNANT TEAMS'!$B$5","v":2},null,"DATE OF MATCH",{"$nulls":6},{"$f":"'PENNANT TEAMS'!$B$4","v":"3rd March"},{"$f":"'PENNANT TEAMS'!$B$5","v":"1900-01-02"},{"$f":"'PENNANT TEAMS'!$B$5","v":"1900-01-02"},{"$f":"'PENNANT TEAMS'!$B$5","v":"1900-01-02"},{"$f":"'PENNANT TEAMS'!$B$5","v":"1900-01-02"},{"$f":"'PENNANT TEAMS'!$B$5","v":"1900-01-02"}]
[]
["HOME SIDE CLUB NAME:",null,null,{"$f":"IF('PENNANT TEAMS'!$B$56=\"Home\",'PENNANT TEAMS'!$C$3,IF('PENNANT TEAMS'!$B$56=\"away\",'PENNANT TEAMS'!$D$56,\"\"))","v":"TEAM8"},{"$nulls":8},"Side No.",null,{"$f":"IF('PENNANT TEAMS'!$B$56=\"home\",'PENNANT TEAMS'!$E$61,\"\")","v":""},null,"VISITING SIDE CLUB NAME:",null,null,{"$f":"IF('PENNANT TEAMS'!$B$56=\"Home\",'PENNANT TEAMS'!$D$56,IF('PENNANT TEAMS'!$B$56=\"away\",'PENNANT TEAMS'!$C$3,\"\"))","v":"Your club name here"},{"$nulls":8},"Side No.",null,{"$f":"IF('PENNANT TEAMS'!$B$56=\"away\",'PENNANT TEAMS'!$E$61,\"\")","v":8}]
["FULL NAMES OF PLAYERS TO BE PRINTED",{"$nulls":10},"REGISTRATION NUMBER",null,null,"SCORE",null,"FULL NAMES OF PLAYERS TO BE PRINTED",{"$nulls":10},"REGISTRATION NUMBER",null,null,"SCORE"]
["Lead",null,{"$f":"IF('PENNANT TEAMS'!$B$56=\"home\",'PENNANT TEAMS'!$B$57,\"\")","v":""},{"$nulls":8},{"$f":"IF('PENNANT TEAMS'!$B$56=\"HOME\",'PENNANT TEAMS'!$B$58,\"\")","v":""},{"$nulls":4},"Lead",null,{"$f":"IF('PENNANT TEAMS'!$B$56=\"away\",'PENNANT TEAMS'!$B$57,\"\")","v":0},{"$nulls":8},{"$f":"IF('PENNANT TEAMS'!$B$56=\"away\",'PENNANT TEAMS'!$B$58,\"\")","v":""}]
["Second",null,{"$f":"IF('PENNANT TEAMS'!$B$56=\"home\",'PENNANT TEAMS'!$C$57,\"\")","v":""},{"$nulls":8},{"$f":"IF('PENNANT TEAMS'!$B$56=\"HOME\",'PENNANT TEAMS'!$C$58,\"\")","v":""},{"$nulls":4},"Second",null,{"$f":"IF('PENNANT TEAMS'!$B$56=\"away\",'PENNANT TEAMS'!$C$57,\"\")","v":0},{"$nulls":8},{"$f":"IF('PENNANT TEAMS'!$B$56=\"away\",'PENNANT TEAMS'!$C$58,\"\")","v":""}]
["Third",null,{"$f":"IF('PENNANT TEAMS'!$B$56=\"home\",'PENNANT TEAMS'!$D$57,\"\")","v":""},{"$nulls":8},{"$f":"IF('PENNANT TEAMS'!$B$56=\"HOME\",'PENNANT TEAMS'!$D58,\"\")","v":""},{"$nulls":4},"Third",null,{"$f":"IF('PENNANT TEAMS'!$B$56=\"away\",'PENNANT TEAMS'!$D$57,\"\")","v":0},{"$nulls":8},{"$f":"IF('PENNANT TEAMS'!$B$56=\"away\",'PENNANT TEAMS'!$D58,\"\")","v":""}]
["Skip",null,{"$f":"IF('PENNANT TEAMS'!$B$56=\"home\",'PENNANT TEAMS'!$E$57,\"\")","v":""},{"$nulls":8},{"$f":"IF('PENNANT TEAMS'!$B$56=\"HOME\",'PENNANT TEAMS'!$E$58,\"\")","v":""},{"$nulls":4},"Skip",null,{"$f":"IF('PENNANT TEAMS'!$B$56=\"away\",'PENNANT TEAMS'!$E$57,\"\")","v":0},{"$nulls":8},{"$f":"IF('PENNANT TEAMS'!$B$56=\"away\",'PENNANT TEAMS'!$E$58,\"\")","v":""}]
["Lead",null,{"$f":"IF('PENNANT TEAMS'!$B$56=\"home\",'PENNANT TEAMS'!$B$59,\"\")","v":""},{"$nulls":8},{"$f":"IF('PENNANT TEAMS'!$B$56=\"HOME\",'PENNANT TEAMS'!$B$60,\"\")","v":""},{"$nulls":4},"Lead",null,{"$f":"IF('PENNANT TEAMS'!$B$56=\"away\",'PENNANT TEAMS'!$B$59,\"\")","v":0},{"$nulls":8},{"$f":"IF('PENNANT TEAMS'!$B$56=\"away\",'PENNANT TEAMS'!$B$60,\"\")","v":""}]
["Second",null,{"$f":"IF('PENNANT TEAMS'!$B$56=\"home\",'PENNANT TEAMS'!$C$59,\"\")","v":""},{"$nulls":8},{"$f":"IF('PENNANT TEAMS'!$B$56=\"HOME\",'PENNANT TEAMS'!$C$60,\"\")","v":""},{"$nulls":4},"Second",null,{"$f":"IF('PENNANT TEAMS'!$B$56=\"away\",'PENNANT TEAMS'!$C$59,\"\")","v":0},{"$nulls":8},{"$f":"IF('PENNANT TEAMS'!$B$56=\"away\",'PENNANT TEAMS'!$C$60,\"\")","v":""}]
["Third",null,{"$f":"IF('PENNANT TEAMS'!$B$56=\"home\",'PENNANT TEAMS'!$D$59,\"\")","v":""},{"$nulls":8},{"$f":"IF('PENNANT TEAMS'!$B$56=\"HOME\",'PENNANT TEAMS'!$D$60,\"\")","v":""},{"$nulls":4},"Third",null,{"$f":"IF('PENNANT TEAMS'!$B$56=\"away\",'PENNANT TEAMS'!$D$59,\"\")","v":0},{"$nulls":8},{"$f":"IF('PENNANT TEAMS'!$B$56=\"away\",'PENNANT TEAMS'!$D$60,\"\")","v":""}]
["Skip",null,{"$f":"IF('PENNANT TEAMS'!$B$56=\"home\",'PENNANT TEAMS'!$E$59,\"\")","v":""},{"$nulls":8},{"$f":"IF('PENNANT TEAMS'!$B$56=\"HOME\",'PENNANT TEAMS'!$E$60,\"\")","v":""},{"$nulls":4},"Skip",null,{"$f":"IF('PENNANT TEAMS'!$B$56=\"away\",'PENNANT TEAMS'!$E$59,\"\")","v":0},{"$nulls":8},{"$f":"IF('PENNANT TEAMS'!$B$56=\"away\",'PENNANT TEAMS'!$E$60,\"\")","v":""}]
[{"$nulls":11},"TOTAL SCORE",{"$nulls":15},"TOTAL SCORE"]
[{"$nulls":11},"RINK WINS",{"$nulls":15},"RINK WINS"]
[{"$nulls":11},"POINTS TOTAL",{"$nulls":15},"POINTS TOTAL"]
["NAME OF WINNING CLUB"]
["Signature and Registration No. of Home Side Manager",{"$nulls":23},"POINT SCORING"]
["Signature and Registration No. of Visiting Side Manager",{"$nulls":23},"[Max Points = 5]"]
["PLEASE NOTE:",{"$nulls":3},"Only One (1) Return Sheet is provided for the Manager of the Home Side.",{"$nulls":20},"Match Win",null,null,"=",3]
[{"$nulls":4},"On completion of the Match, both Managers must fill in the Pennant Return and sign it.",{"$nulls":20},"Match Draw",null,null,"=","1½"]
[{"$nulls":4},"The Home Side then posts the Pennant Return to the District Chairman of Match:",{"$nulls":20},"Team Win",null,null,"=",1]
[{"$nulls":4}," Pattie Payne, 55 Hobart Avenue, UMINA BEACH. 2257",{"$nulls":20},"Team Draw",null,null,"=","½"]
["CENTRAL COAST DISTRICT WOMEN'S BOWLING ASSOCIATION - PENNANT RETURN SHEET"]
[]
["GRADE No.",null,null,{"$f":"'PENNANT TEAMS'!$A$64","v":9},null,"SECTION No.",{"$nulls":4},{"$f":"'PENNANT TEAMS'!$C$68","v":9},null,null,"ROUND No.",{"$nulls":3},{"$f":"'PENNANT TEAMS'!$B$5","v":2},null,"DATE OF MATCH",{"$nulls":6},{"$f":"'PENNANT TEAMS'!$B$4","v":"3rd March"},{"$f":"'PENNANT TEAMS'!$B$5","v":"1900-01-02"},{"$f":"'PENNANT TEAMS'!$B$5","v":"1900-01-02"},{"$f":"'PENNANT TEAMS'!$B$5","v":"1900-01-02"},{"$f":"'PENNANT TEAMS'!$B$5","v":"1900-01-02"},{"$f":"'PENNANT TEAMS'!$B$5","v":"1900-01-02"}]
[]
["HOME SIDE CLUB NAME:",null,null,{"$f":"IF('PENNANT TEAMS'!$B$63=\"Home\",'PENNANT TEAMS'!$C$3,IF('PENNANT TEAMS'!$B$63=\"away\",'PENNANT TEAMS'!$D$63,\"\"))","v":"TEAM9"},{"$nulls":8},"Side No.",null,{"$f":"IF('PENNANT TEAMS'!$B$63=\"home\",'PENNANT TEAMS'!$E$68,\"\")","v":""},null,"VISITING SIDE CLUB NAME:",null,null,{"$f":"IF('PENNANT TEAMS'!$B$63=\"Home\",'PENNANT TEAMS'!$D$63,IF('PENNANT TEAMS'!$B$63=\"away\",'PENNANT TEAMS'!$C$3,\"\"))","v":"Your club name here"},{"$nulls":8},"Side No.",null,{"$f":"IF('PENNANT TEAMS'!$B$63=\"away\",'PENNANT TEAMS'!$E$68,\"\")","v":9}]
["FULL NAMES OF PLAYERS TO BE PRINTED",{"$nulls":10},"REGISTRATION NUMBER",null,null,"SCORE",null,"FULL NAMES OF PLAYERS TO BE PRINTED",{"$nulls":10},"REGISTRATION NUMBER",null,null,"SCORE"]
["Lead",null,{"$f":"IF('PENNANT TEAMS'!$B$63=\"home\",'PENNANT TEAMS'!$B$64,\"\")","v":""},{"$nulls":8},{"$f":"IF('PENNANT TEAMS'!$B$63=\"HOME\",'PENNANT TEAMS'!$B$65,\"\")","v":""},{"$nulls":4},"Lead",null,{"$f":"IF('PENNANT TEAMS'!$B$63=\"away\",'PENNANT TEAMS'!$B$64,\"\")","v":0},{"$nulls":8},{"$f":"IF('PENNANT TEAMS'!$B$63=\"away\",'PENNANT TEAMS'!$B$65,\"\")","v":""}]
["Second",null,{"$f":"IF('PENNANT TEAMS'!$B$63=\"home\",'PENNANT TEAMS'!$C$64,\"\")","v":""},{"$nulls":8},{"$f":"IF('PENNANT TEAMS'!$B$63=\"HOME\",'PENNANT TEAMS'!$C$65,\"\")","v":""},{"$nulls":4},"Second",null,{"$f":"IF('PENNANT TEAMS'!$B$63=\"away\",'PENNANT TEAMS'!$C$64,\"\")","v":0},{"$nulls":8},{"$f":"IF('PENNANT TEAMS'!$B$63=\"away\",'PENNANT TEAMS'!$C$65,\"\")","v":""}]
["Third",null,{"$f":"IF('PENNANT TEAMS'!$B$63=\"home\",'PENNANT TEAMS'!$D$64,\"\")","v":""},{"$nulls":8},{"$f":"IF('PENNANT TEAMS'!$B$63=\"HOME\",'PENNANT TEAMS'!$D65,\"\")","v":""},{"$nulls":4},"Third",null,{"$f":"IF('PENNANT TEAMS'!$B$63=\"away\",'PENNANT TEAMS'!$D$64,\"\")","v":0},{"$nulls":8},{"$f":"IF('PENNANT TEAMS'!$B$63=\"away\",'PENNANT TEAMS'!$D65,\"\")","v":""}]
["Skip",null,{"$f":"IF('PENNANT TEAMS'!$B$63=\"home\",'PENNANT TEAMS'!$E$64,\"\")","v":""},{"$nulls":8},{"$f":"IF('PENNANT TEAMS'!$B$63=\"HOME\",'PENNANT TEAMS'!$E$65,\"\")","v":""},{"$nulls":4},"Skip",null,{"$f":"IF('PENNANT TEAMS'!$B$63=\"away\",'PENNANT TEAMS'!$E$64,\"\")","v":0},{"$nulls":8},{"$f":"IF('PENNANT TEAMS'!$B$63=\"away\",'PENNANT TEAMS'!$E$65,\"\")","v":""}]
["Lead",null,{"$f":"IF('PENNANT TEAMS'!$B$63=\"home\",'PENNANT TEAMS'!$B$66,\"\")","v":""},{"$nulls":8},{"$f":"IF('PENNANT TEAMS'!$B$63=\"HOME\",'PENNANT TEAMS'!$B$67,\"\")","v":""},{"$nulls":4},"Lead",null,{"$f":"IF('PENNANT TEAMS'!$B$63=\"away\",'PENNANT TEAMS'!$B$66,\"\")","v":0},{"$nulls":8},{"$f":"IF('PENNANT TEAMS'!$B$63=\"away\",'PENNANT TEAMS'!$B$67,\"\")","v":""}]
["Second",null,{"$f":"IF('PENNANT TEAMS'!$B$63=\"home\",'PENNANT TEAMS'!$C$66,\"\")","v":""},{"$nulls":8},{"$f":"IF('PENNANT TEAMS'!$B$63=\"HOME\",'PENNANT TEAMS'!$C$67,\"\")","v":""},{"$nulls":4},"Second",null,{"$f":"IF('PENNANT TEAMS'!$B$63=\"away\",'PENNANT TEAMS'!$C$66,\"\")","v":0},{"$nulls":8},{"$f":"IF('PENNANT TEAMS'!$B$63=\"away\",'PENNANT TEAMS'!$C$67,\"\")","v":""}]
["Third",null,{"$f":"IF('PENNANT TEAMS'!$B$63=\"home\",'PENNANT TEAMS'!$D$66,\"\")","v":""},{"$nulls":8},{"$f":"IF('PENNANT TEAMS'!$B$63=\"HOME\",'PENNANT TEAMS'!$D$67,\"\")","v":""},{"$nulls":4},"Third",null,{"$f":"IF('PENNANT TEAMS'!$B$63=\"away\",'PENNANT TEAMS'!$D$66,\"\")","v":0},{"$nulls":8},{"$f":"IF('PENNANT TEAMS'!$B$63=\"away\",'PENNANT TEAMS'!$D$67,\"\")","v":""}]
["Skip",null,{"$f":"IF('PENNANT TEAMS'!$B$63=\"home\",'PENNANT TEAMS'!$E$66,\"\")","v":""},{"$nulls":8},{"$f":"IF('PENNANT TEAMS'!$B$63=\"HOME\",'PENNANT TEAMS'!$E$67,\"\")","v":""},{"$nulls":4},"Skip",null,{"$f":"IF('PENNANT TEAMS'!$B$63=\"away\",'PENNANT TEAMS'!$E$66,\"\")","v":0},{"$nulls":8},{"$f":"IF('PENNANT TEAMS'!$B$63=\"away\",'PENNANT TEAMS'!$E$67,\"\")","v":""}]
[{"$nulls":11},"TOTAL SCORE",{"$nulls":15},"TOTAL SCORE"]
[{"$nulls":11},"RINK WINS",{"$nulls":15},"RINK WINS"]
[{"$nulls":11},"POINTS TOTAL",{"$nulls":15},"POINTS TOTAL"]
["NAME OF WINNING CLUB"]
["Signature and Registration No. of Home Side Manager",{"$nulls":23},"POINT SCORING"]
["Signature and Registration No. of Visiting Side Manager",{"$nulls":23},"[Max Points = 5]"]
["PLEASE NOTE:",{"$nulls":3},"Only One (1) Return Sheet is provided for the Manager of the Home Side.",{"$nulls":20},"Match Win",null,null,"=",3]
[{"$nulls":4},"On completion of the Match, both Managers must fill in the Pennant Return and sign it.",{"$nulls":20},"Match Draw",null,null,"=","1½"]
[{"$nulls":4},"The Home Side then posts the Pennant Return to the District Chairman of Match:",{"$nulls":20},"Team Win",null,null,"=",1]
[{"$nulls":4}," Pattie Payne, 55 Hobart Avenue, UMINA BEACH. 2257",{"$nulls":20},"Team Draw",null,null,"=","½"]